program: Gaussian 09
title: Title Card Required
version: ES64L-G09RevD.01
method: RB3LYP
basis: Gen
operation: Freq
keyword: #P
keyword: Geom=AllCheck
keyword: Guess=TCheck
keyword: SCRF=Check
keyword: GenChk
keyword: RB3LYP/ChkBas
keyword: Freq
converged: YES YES YES YES
title: Mulliken charges:
elementType: Br
charge: -1.000000
chargesum: -1.00000
title: Mulliken charges with hydrogens summed into heavy atoms:
polarizability: 7.14429278e-01 1.08561767e-16 7.14429278e-01 -6.47341686e-16 -4.83081123e-16 7.14429278e-01
1716.lowfreq: 0.0000 0.0000 0.0000
temp: 298.150 k
press: 1.00000 atm
elementType: 35
zpe: 0.0 jmol-1
zpe.correction: 0.000000 hartree
zpe.thermalcorrener: 0.001416 hartree
zpe.thermalcorrenthalpy: 0.002360 hartree
zpe.thermalcorrgfe: -0.016176 hartree
zpe.sumelectzpe: -13.525160 hartree
zpe.sumelectthermal: -13.523743 hartree
zpe.sumelectthermalent: -13.522799 hartree
zpe.sumelectthermalfe: -13.541335 hartree
dipole: 0.0000 0.0000 0.0000
dipole: 0.0000
quadrupole: -20.9375 -20.9375 -20.9375
quadrupole: 0.0000 0.0000 0.0000
quadrupole: 0.0000 0.0000 0.0000 0.0000 0.0000 0.0000
hfenergy: -13.5251596 hartree
pointgroup: OH [O(Br1)]
dipole: 0. 0. 0. debye
dipolederiv: -1. 0. 0. 0. -1. 0. 0. 0. -1. unknown
polarizability: 0.7144293|0.|0.7144293|0.|0.|0.7144293 unknown
InChI: InChI=1/Br
charge -1 multiplicity 1
1 atoms
Br 0.0000 0.0000 0.0000
