program: Gaussian 09
title: Title Card Required
version: ES64L-G09RevD.01
method: RB3LYP
basis: Gen
operation: Freq
keyword: #P
keyword: Geom=AllCheck
keyword: Guess=TCheck
keyword: SCRF=Check
keyword: GenChk
keyword: RB3LYP/ChkBas
keyword: Freq
converged: YES YES NO YES
title: Mulliken charges:
elementType: C O O O Cs Cs
charge: 0.577610 -0.788962 -0.711087 -0.711131 0.816783 0.816787
chargesum: 0.00000
title: Mulliken charges with hydrogens summed into heavy atoms:
polarizability: 4.03270268e+01 1.47952968e+01 1.00307658e+02 -1.72677753e+01 -1.58980673e+01 7.02272036e+01
1716.lowfreq: -1.4253 0.0003 0.0004 0.0008 9.9437 26.9353 52.2868 67.2659 83.7390
frequency: 52.2269 66.6503 83.0948 135.8519 167.5591 201.2485 672.4144 675.5877 851.0566 1040.9711 1372.1004 1506.2848
redmass: 55.6082 16.9621 16.2526 21.1026 18.8635 16.3737 15.6655 15.6419 12.6419 15.8810 12.9502 12.8602
irintensity: 9.1122 16.8400 0.0579 52.8720 104.4125 0.4360 0.2347 1.7975 17.4003 15.7449 524.2380 1001.0232
temp: 298.150 k
press: 1.00000 atm
elementType: 6 8 8 8 55 55
symmnumber: 1
zpe: 40822.8 jmol-1
zpe.correction: 0.015549 hartree
zpe.thermalcorrener: 0.022976 hartree
zpe.thermalcorrenthalpy: 0.023920 hartree
zpe.thermalcorrgfe: -0.021944 hartree
zpe.sumelectzpe: -304.187155 hartree
zpe.sumelectthermal: -304.179727 hartree
zpe.sumelectthermalent: -304.178783 hartree
zpe.sumelectthermalfe: -304.224647 hartree
dipole: -3.5406 6.2939 10.2836
dipole: 12.5659
quadrupole: -14.6126 -0.9037 -42.1304
quadrupole: -25.7063 -66.3079 -7.4276
quadrupole: 4.6030 18.3119 -22.9149 -25.7063 -66.3079 -7.4276
hfenergy: -304.2027035 hartree
pointgroup: C01 [X(C1Cs2O3)]
dipole: -1.392991 2.4761993 4.0458799 debye
dipolederiv: 0.3739785 0.3594142 -0.6753064 0.36428 2.3674181 -0.196878 -0.6793786 -0.1968841 1.7608139 -0.7283073 0.0634155 0.2692864 0.0638973 -1.1326333 -0.3264361 0.2674936 -0.3247177 -1.4273175 -0.6378278 -0.2100599 0.0924082 -0.2549677 -2.087115 0.1678035 0.0790695 0.0567016 -0.7531311 -0.7694114 -0.332265 0.3930851 -0.2917341 -1.2761667 0.5294215 0.4139988 0.6397344 -1.4348667 0.8610492 0.0294841 -0.0019816 0.0637871 1.1677428 -0.0713318 0.0063864 0.0114349 0.8439319 0.9005189 0.0900111 -0.0774917 0.0547375 0.9607542 -0.1025792 -0.0875696 -0.186269 1.0105694 unknown
polarizability: 40.3270268|14.7952968|100.307658|-17.2677753|-15.8980673|70.2272036 unknown
InChI: InChI=1/CO3.2Cs/c2-1(3)4;;/q-2;2*+1/rCCs2O3/c4-1-2(4)6(1)3(1)5-1
charge 0 multiplicity 1
6 atoms
C  -5.53305509 1.01604166 0.02224194
O  -5.87523295 1.67728577 1.12180703
O  -5.67751457 -0.26811139 -0.01450613
O  -5.0623292 1.66993923 -0.98868033
Cs -5.16953585 4.30683922 0.07596969
Cs -6.78974235 -0.68122449 2.57395879
