program: Gaussian 09
title: Title
version: ES64L-G09RevD.01
method: UB3LYP
basis: Gen
operation: Freq
keyword: #P
keyword: Geom=AllCheck
keyword: Guess=TCheck
keyword: SCRF=Check
keyword: GenChk
keyword: UB3LYP/ChkBas
keyword: Freq
converged: YES YES NO YES
polarizability: 5.97295436e+02 1.61342568e+01 7.27391126e+02 2.11192617e+02 -4.80048070e+01 1.14572816e+03
1716.lowfreq: -164.4967 -0.0052 -0.0032 -0.0026 4.7844 6.3092 9.8540 10.4329 12.7476
frequency: -164.4948 9.2675 12.0468 13.4781 15.6682 18.4711 23.8301 27.9370 33.1612 43.9519 58.3929 73.9501 78.5301 89.5629 93.0173 101.3891 107.1928 124.0881 128.2184 137.6556 148.9306 153.2610 174.0541 187.9693 199.5333 234.0872 237.7756 246.6445 260.0494 268.2507 275.5421 287.6599 289.5466 310.0122 326.5801 373.6116 400.3605 415.0129 420.9957 421.8539 428.4061 444.4166 454.0760 488.0114 515.9812 517.2366 523.2774 527.7559 556.3529 559.4145 560.0796 567.6987 571.3739 607.7993 621.0547 627.5819 632.6818 634.7203 652.1926 708.0520 708.9249 714.7308 736.5699 742.4290 743.0116 775.1640 778.7646 790.0485 803.5437 819.5069 838.9744 850.0473 852.8410 860.1494 868.1025 880.4345 882.6913 917.1119 917.8742 931.1371 953.1542 973.9269 974.5029 977.0809 977.7729 985.2391 994.6316 1000.6086 1004.5184 1010.9179 1011.7350 1012.1792 1013.4347 1016.3065 1053.0120 1054.1709 1055.0046 1071.5417 1080.7968 1104.7834 1111.8921 1113.0144 1125.5011 1166.8097 1170.1785 1175.7083 1180.6027 1181.5705 1201.0994 1202.7042 1235.6069 1237.2824 1242.3619 1255.6177 1271.5097 1282.9759 1292.8836 1312.3822 1322.0685 1348.7379 1351.9337 1361.6683 1368.4722 1368.7727 1381.9955 1418.9267 1425.9910 1453.5733 1454.3515 1463.7679 1476.1700 1479.0924 1483.2445 1485.6842 1493.9399 1498.2058 1517.0822 1533.7379 1539.4479 1541.6205 1562.2723 1586.3899 1619.9991 1627.5351 1642.3626 1651.2818 1651.5455 1655.9940 1656.9044 1671.4933 1696.0381 2187.3984 2998.2492 3008.6389 3100.2755 3106.2182 3137.6690 3171.6415 3185.9210 3190.5946 3191.8108 3196.4480 3201.4865 3205.8117 3207.4174 3211.0390 3211.0990 3215.3109 3216.6964 3217.0801 3218.0620 3221.6590 3235.2369 3238.4529 3246.5967 3277.8608 3619.7004
redmass: 10.9599 6.6141 4.4404 5.0092 5.6921 6.0605 5.9661 6.7262 3.9360 9.6150 9.4547 6.4316 6.4183 7.9579 6.1710 7.2136 5.2997 3.7599 6.2129 7.0886 2.9031 6.1113 7.8466 1.3858 1.1319 7.1969 3.6068 3.0535 5.6396 10.2358 3.1372 7.2474 6.0757 3.4795 3.5125 4.7180 5.8272 2.9857 3.9990 3.1057 6.9786 2.9193 3.9429 6.5924 3.5281 4.4158 2.9099 7.9239 6.5681 3.0924 4.3131 7.4404 5.0966 1.2542 3.8882 4.3809 6.0639 6.5664 8.1343 1.9146 2.2936 4.9702 6.2536 6.5165 3.3958 1.6480 1.8136 1.2020 6.2373 1.3866 5.1396 6.0232 1.2509 1.2482 1.6625 6.3555 4.9234 5.2210 1.4243 1.4147 1.2611 1.3916 1.3255 1.3987 1.3493 2.2828 1.3139 1.2465 1.2614 4.8133 5.6441 1.4167 1.3514 1.3638 5.3718 2.2321 2.1345 1.5407 2.4721 1.5825 1.5391 2.2383 1.9859 1.2318 2.8562 1.1902 1.1069 1.0834 1.1414 1.1304 1.6511 3.4544 3.3465 1.8128 3.3517 2.8987 1.8101 3.3903 3.4397 2.0029 4.0204 1.7295 4.3981 3.5954 2.4275 1.2895 1.2146 1.9833 3.4694 2.3952 1.1083 1.7125 2.2216 1.1080 2.8803 1.0807 1.1655 2.1778 2.3216 3.2734 4.3494 1.8893 5.1631 6.3447 5.6429 4.0876 5.5024 6.6021 4.9225 6.6571 5.9227 11.9960 1.0596 1.0563 1.0784 1.0754 1.1027 1.1004 1.0870 1.0856 1.0887 1.0881 1.0929 1.0917 1.0878 1.0916 1.0939 1.0975 1.0909 1.0913 1.0982 1.0968 1.0917 1.0968 1.0969 1.0915 1.0762
irintensity: 826.4876 1.8348 0.0527 0.0956 0.1936 0.3856 2.6946 1.8249 1.0349 3.1547 1.2365 9.2360 2.4263 2.7522 15.2687 1.9831 7.3655 1.9339 9.9859 5.1924 0.5080 5.8457 2.4596 0.5770 7.0884 39.4087 1.3722 44.9631 32.1116 21.2148 1.6033 5.0773 42.6344 213.4599 11.7218 15.9521 11.7366 0.0773 11.3621 0.3224 26.5025 12.5474 1.4261 7.4996 0.8685 3.0133 34.4058 7.0365 3.1721 3.3529 18.3988 1.1069 9.9483 266.5593 3.8470 10.9804 3.7717 0.0223 40.7226 33.5830 38.3108 26.1680 26.5538 18.4346 69.0109 91.3779 64.5417 12.3287 32.5472 1.0008 15.2404 2.6776 0.0536 0.0052 94.2274 16.6157 14.4301 8.2959 13.5816 7.3606 3.6118 4.0205 0.0038 0.1949 0.0068 260.6338 0.0394 1.5086 0.2173 1.1688 3.4730 65.0922 2.2930 0.0445 0.4905 13.7125 8.3437 188.1042 15.0390 12.2339 68.5038 0.1994 37.7902 47.0636 622.0661 2.0920 29.9444 0.0423 3.9332 0.6144 36.1635 37.8405 11.6274 22.9894 130.9868 881.7453 1.4342 892.6807 0.1374 582.6703 9.3695 0.0133 67.6185 31.0294 18.2349 28.6046 191.7557 2.8836 14.9359 90.9340 5.9415 300.5191 4.9804 32.1517 44.9568 95.6205 283.8914 58.0101 247.1987 27.0999 179.2590 519.6718 4.1142 48.4327 13.9205 196.8405 43.6288 0.6706 22.5077 19.7777 737.2716 249.2459 55.4459 116.9870 29.5964 26.5852 30.7512 11.1690 12.5381 5.0806 6.6245 2.3979 38.1205 23.6633 0.3637 11.4259 70.9832 40.7647 4.1223 4.0731 27.3290 25.9206 1.1351 26.7856 6.1748 5.5127 90.9837
temp: 298.150 k
press: 1.00000 atm
elementType: 29 6 6 6 6 6 1 6 6 6 1 6 6 6 1 1 6 1 1 1 1 7 7 6 6 6 6 6 6 1 6 1 6 1 1 1 35 6 6 6 6 8 7 1 1 1 1 1 1 1 6 6 6 6 1 6 1 6 1 1 1
symmnumber: 1
zpe: 1247259.2 jmol-1
zpe.correction: 0.475056 hartree
zpe.thermalcorrener: 0.508851 hartree
zpe.thermalcorrenthalpy: 0.509795 hartree
zpe.thermalcorrgfe: 0.400821 hartree
zpe.sumelectzpe: -1608.030029 hartree
zpe.sumelectthermal: -1607.996234 hartree
zpe.sumelectthermalent: -1607.995290 hartree
zpe.sumelectthermalfe: -1608.104263 hartree
dipole: -2.0637 -9.5183 -4.0962
dipole: 10.5658
quadrupole: -225.2746 -177.0021 -165.5401
quadrupole: 19.0621 -17.1321 38.3731
quadrupole: -36.0023 12.2701 23.7322 19.0621 -17.1321 38.3731
hfenergy: -1608.5050847 hartree
pointgroup: C01 [X(C30H25Br1Cu1N3O1)]
dipole: -0.8119207 -3.744806 -1.6115524 debye
polarizability: 597.2954356|16.1342568|727.3911257|211.192617|-48.004807|1145.7281614 unknown
InChI: InChI=1/C12H8N2.C10H12NO.C8H5.BrH.Cu/c1-3-9-5-6-10-4-2-8-14-12(10)11(9)13-7-1;1-8(2)10(12)11-9-6-4-3-5-7-9;1-2-8-6-4-3-5-7-8;;/h1-8H;3-7,11H,1-2H3;3-7H;1H;/q-1;;;;+2/p-1/rC20H13BrCuN2.C10H12NO/c21-22(13-12-16-6-2-1-3-7-16)24-15-5-9-18-11-10-17-8-4-14-23-19(17)20(18)24;1-8(2)10(12)11-9-6-4-3-5-7-9/h1-11,14-15H;3-7,11H,1-2H3
charge 0 multiplicity 1
61 atoms
Cu -0.43994472 0.64042875 -1.57356211
C  -0.62193946 -2.24155394 -1.84245107
C  -1.16470491 -1.59304837 0.31663194
C  -0.20794595 -1.85899548 -3.16861761
C  -0.84815125 -3.60776607 -1.54749941
C  -1.42271561 -2.92186634 0.69472678
H  -1.26478359 -0.78204709 1.02959977
C  -0.02148222 -2.852359 -4.16039347
C  -0.65408945 -4.59128612 -2.57614541
C  -1.26120631 -3.93040245 -0.23531262
H  -1.7383996 -3.13418853 1.71039445
C  0.39439004 -2.41529121 -5.43928195
C  -0.25589945 -4.22981759 -3.829645
C  0.37332375 -0.15512031 -4.61721527
H  -0.83243939 -5.63392515 -2.329307
H  -1.44588173 -4.96835086 0.02710744
C  0.59406683 -1.06728643 -5.66718251
H  0.55126306 -3.1447615 -6.22897021
H  -0.10940029 -4.97892796 -4.60257477
H  0.51204606 0.91219457 -4.76666919
H  0.91363547 -0.7006924 -6.63694096
N  -0.77706099 -1.25961534 -0.91300637
N  -0.01455144 -0.53853724 -3.40693877
C  -0.77948095 2.41388909 -2.16108831
C  -1.02971882 3.54114954 -2.58734295
C  -1.33845184 4.84900171 -3.0821206
C  -1.97512909 5.80185105 -2.25757475
C  -1.01908372 5.21505951 -4.40767683
C  -2.28083996 7.07159999 -2.7447505
H  -2.2272845 5.53441548 -1.23519207
C  -1.32623734 6.48747509 -4.88707975
H  -0.52993373 4.49180436 -5.05429229
C  -1.95858274 7.42088258 -4.05989404
H  -2.77225809 7.79133019 -2.09504962
H  -1.07213737 6.75062128 -5.91070141
H  -2.19849328 8.41157794 -4.43662831
Br 1.17079218 1.23139012 0.36070045
C  3.28018901 1.4319231 2.14940619
C  2.79273701 0.37488998 3.07101721
C  4.40772766 1.03839474 1.24862336
C  3.1487952 2.89238415 2.4730465
O  3.16691955 -0.8002677 2.96394884
N  1.92460372 0.79670981 4.05924304
H  4.33746647 -0.0069902 0.9442972
H  4.45008722 1.68037895 0.36370685
H  5.36471268 1.16264106 1.78464513
H  2.14705725 3.19224224 2.79661154
H  3.85087233 3.16114296 3.28000603
H  3.40643567 3.50203488 1.601944
H  1.66227574 1.7737371 4.04789
C  1.27757686 0.04167004 5.05104614
C  0.37914065 0.72955042 5.89083298
C  1.48139257 -1.33609753 5.25190141
C  -0.29981885 0.05815806 6.90370771
H  0.22007836 1.79524335 5.7410929
C  0.79125853 -1.99405214 6.27265059
H  2.1717299 -1.86909532 4.61417667
C  -0.09973257 -1.3117316 7.10350257
H  -0.98812445 0.60984544 7.53884787
H  0.95972733 -3.05864815 6.41597597
H  -0.62902942 -1.83604653 7.89422863
