program: Gaussian 09
title: Title
version: ES64L-G09RevD.01
method: RB3LYP
basis: Gen
operation: Freq
keyword: #P
keyword: Geom=AllCheck
keyword: Guess=TCheck
keyword: SCRF=Check
keyword: GenChk
keyword: RB3LYP/ChkBas
keyword: Freq
converged: YES YES NO NO
title: Mulliken charges:
elementType: C O N H C C C H H H H H H Br C C C C H C H C H H H
charge: 0.619991 -0.475429 -0.670319 0.388511 -0.252130 -0.448760 -0.421767 0.191211 0.196119 0.199674 0.189210 0.186422 0.182069 -0.144986 0.315939 -0.215843 -0.187177 -0.159042 0.172443 -0.168534 0.177526 -0.154055 0.162076 0.160230 0.156619
chargesum: 0.00000
title: Mulliken charges with hydrogens summed into heavy atoms:
elementType: C O N C C C Br C C C C C C
charge: 0.619991 -0.475429 -0.281808 -0.252130 0.138244 0.135935 -0.144986 0.315939 -0.043400 -0.009651 0.003034 -0.008304 0.002565
polarizability: 2.06438429e+02 -2.67435180e+01 1.93754979e+02 -5.20373806e-01 -2.32678608e+01 1.21858206e+02
1716.lowfreq: -27.5869 -20.2656 -11.7854 0.0006 0.0007 0.0007 14.8290 39.5885 73.0879
frequency: -13.7861 38.8238 72.3159 114.9684 145.5435 217.5248 247.3534 259.7263 270.4849 289.8297 304.0214 334.3731 381.2025 418.0438 430.9619 454.2453 525.8559 581.5823 585.3669 629.5050 649.2917 704.9772 751.3201 775.6338 838.7714 848.7142 893.9714 918.4782 964.1323 974.1133 975.9177 1003.7974 1011.1995 1036.8787 1056.8628 1117.4265 1127.4381 1185.8614 1192.4645 1210.5127 1235.1558 1278.6365 1288.8650 1355.8412 1368.7433 1433.4304 1446.3189 1481.2833 1486.7340 1495.8244 1505.0150 1522.1904 1541.1992 1578.6854 1652.2395 1657.6394 1757.6425 3057.7423 3064.9506 3132.2744 3138.8325 3154.6912 3179.8647 3184.9219 3194.1149 3204.0596 3217.3797 3279.2789 3588.6200
redmass: 3.9868 7.1523 6.7353 4.7722 6.9866 3.0608 3.0588 3.6730 1.2032 3.3126 1.2499 3.3537 4.3671 3.0474 3.9383 2.8958 3.0067 5.3293 1.1916 6.3277 4.4000 2.1307 4.7959 1.7310 5.0536 1.2786 5.0400 1.4219 2.3862 1.5197 1.3348 1.2557 5.9076 1.2878 2.1710 1.5592 1.6035 2.5765 1.1279 1.1351 3.2463 3.1030 2.4725 1.8062 3.1324 1.2417 1.1919 1.6090 1.2371 1.0508 1.0748 1.0749 2.2403 2.0085 4.0593 5.5727 9.1048 1.0408 1.0426 1.0965 1.0952 1.1043 1.1035 1.0891 1.0882 1.0929 1.0977 1.0917 1.0783
irintensity: 0.7711 2.2344 9.2776 0.9625 5.2844 1.0712 0.2132 22.0807 5.0668 8.0413 3.9898 2.7004 20.3149 0.6534 52.4853 22.4967 5.8565 28.6811 84.1345 0.9232 19.8662 36.4353 10.1058 80.4489 4.0822 1.0071 23.8027 12.8979 31.7742 8.3335 0.0023 1.2477 0.1503 4.7983 7.8222 47.5140 109.1112 75.8985 8.1737 11.1216 21.5091 85.5319 29.2859 106.3926 23.8431 18.5407 10.1339 92.3221 42.6527 7.6201 14.1204 30.2444 120.5608 472.7427 89.4133 68.6783 381.0597 5.5771 13.3170 10.2526 14.1082 28.6652 12.4511 13.0433 2.5751 36.1727 27.7955 2.3504 77.1176
temp: 298.150 k
press: 1.00000 atm
elementType: 6 8 7 1 6 6 6 1 1 1 1 1 1 35 6 6 6 6 1 6 1 6 1 1 1
symmnumber: 1
zpe: 532467.8 jmol-1
zpe.correction: 0.202806 hartree
zpe.thermalcorrener: 0.214801 hartree
zpe.thermalcorrenthalpy: 0.215745 hartree
zpe.thermalcorrgfe: 0.163609 hartree
zpe.sumelectzpe: -531.500894 hartree
zpe.sumelectthermal: -531.488900 hartree
zpe.sumelectthermalent: -531.487956 hartree
zpe.sumelectthermalfe: -531.540092 hartree
dipole: 2.4251 2.6201 3.4051
dipole: 4.9336
quadrupole: -74.4255 -83.0330 -95.1896
quadrupole: -2.9440 -1.9541 3.9383
quadrupole: 9.7906 1.1830 -10.9736 -2.9440 -1.9541 3.9383
hfenergy: -531.7037005 hartree
pointgroup: C01 [X(C10H12Br1N1O1)]
dipole: 0.9540999 1.0308194 1.3396578 debye
dipolederiv: 2.5400994 -0.6301904 0.3591969 0.5675896 1.0817096 -0.322324 0.15148 -0.1836286 0.1492675 -1.3916018 0.1547986 -0.0491756 -0.720434 -0.934489 0.1197609 0.0182049 0.073114 -0.37937 -2.045204 0.8782606 -0.2291776 0.7441287 -0.9718566 0.0981052 -0.1370954 0.0190953 -0.4309217 0.240314 0.0136037 -0.0123523 0.00279 0.2625517 0.031171 0.0071019 0.0595986 0.3481688 0.4729137 0.0912781 -0.2958992 -0.0370572 0.249789 -0.0769445 -0.1370805 -0.2016308 1.5365507 -0.0549696 0.0033437 -0.0109509 0.0038282 -0.0682199 0.0567118 -0.0657778 -0.0257265 -0.2197329 -0.0894742 -0.0407932 0.0090394 0.0030823 0.0074934 0.0427342 0.0768914 0.0231073 -0.1702312 -0.1463069 -0.0182607 0.0240693 -0.0217917 0.0961054 -0.0482004 0.0623471 -0.0110744 0.0717218 0.0486241 0.0878113 -0.0331544 0.0990065 -0.0863592 -0.0150833 -0.0188788 0.0119592 0.0917746 0.1102444 -0.0230276 -0.020506 -0.0219051 0.0671692 -0.0265641 0.0125107 0.0400319 -0.1189937 0.0580426 -0.051776 -0.0087659 -0.0846938 0.021934 -0.0867428 -0.0425028 -0.0891178 0.0302252 0.0295488 -0.0190208 0.09927 -0.0234368 0.1058174 0.058633 0.0291615 0.0463259 -0.0938133 0.0111415 0.059698 0.0122063 0.0969828 -0.0848244 0.0311986 -0.0232785 0.0439881 0.1017463 -0.3843304 -0.006865 0.1350631 0.0787338 -0.4551405 0.1944612 0.0005573 0.2486453 -1.0555895 0.7831387 -0.6720108 0.0547653 -0.9081822 0.9013784 -0.0876851 0.0818423 -0.0648039 0.1968028 -0.271441 0.279924 -0.0255198 0.0849208 -0.0471459 -0.0009786 -0.0056215 -0.0145453 -0.1980028 -0.1173017 0.0043829 -0.0109058 0.1970069 -0.2927501 0.0115558 -0.019803 0.0094163 -0.1818945 0.1848687 -0.0371795 0.0011398 0.0707246 0.1006148 -0.0208213 -0.0179458 -0.0196222 -0.1273075 0.0960106 -0.029624 0.0044072 -0.0443433 -0.1189975 0.0276103 0.0085179 0.0279482 0.1576514 0.0978401 0.1107691 -0.019235 -0.0108179 0.1827834 -0.0364229 -0.0023599 -0.0244906 -0.1335979 0.0374622 -0.0703347 0.0121676 -0.032517 0.1760266 -0.0079192 0.0103965 -0.0118817 0.1624738 -0.1417371 -0.0937557 0.0023422 -0.0574647 -0.1240749 0.0043579 0.0055456 -0.004575 -0.1614858 -0.1312719 -0.0365092 0.0045509 -0.0528759 0.0887046 0.0064145 0.0078008 0.0054798 0.1402516 0.0739445 -0.0752394 0.0083364 -0.0543896 -0.1219256 0.0290732 0.0060392 0.0278759 0.1359845 -0.0105548 0.120717 -0.010912 0.1211152 -0.0362939 0.0178986 -0.0080531 0.014511 0.1483218 unknown
polarizability: 206.4384291|-26.743518|193.7549795|-0.5203738|-23.2678608|121.8582058 unknown
InChI: InChI=1/C10H12BrNO/c1-10(2,11)9(13)12-8-6-4-3-5-7-8/h3-7,12H,1-2H3
charge 0 multiplicity 1
25 atoms
C  -0.0446169 -0.43489298 -0.18154572
O  -0.75112463 -1.43554963 -0.11194429
N  1.31905687 -0.44444717 -0.11654875
H  1.78892686 0.44761427 -0.2097849
C  -0.68681427 0.96354373 -0.3316247
C  -0.05524218 2.05923343 0.51363959
C  -2.19092438 0.89489253 -0.15591976
H  1.00179147 2.23065209 0.29625241
H  -0.58661691 3.00354046 0.36791586
H  -0.14623721 1.77017113 1.56889301
H  -2.64141368 0.13475039 -0.79507207
H  -2.40030245 0.63045218 0.88847181
H  -2.64434563 1.86755467 -0.36242694
Br -0.34407747 1.47446236 -2.35362306
C  2.19347902 -1.5480502 -0.02038643
C  3.57100091 -1.26783849 -0.06464874
C  1.76332898 -2.87811798 0.11977301
C  4.50302346 -2.29854741 0.02580483
H  3.90572781 -0.23860711 -0.17017197
C  2.71175517 -3.90016486 0.20795369
H  0.70701849 -3.10170511 0.15703711
C  4.07972068 -3.62442273 0.1621144
H  5.56310433 -2.06212525 -0.01092339
H  2.36764487 -4.92571546 0.3149019
H  4.80648679 -4.42889384 0.2319181
