program: Gaussian 09
title: Title
version: ES64L-G09RevD.01
method: RB3LYP
basis: Gen
operation: Freq
keyword: #P
keyword: Geom=AllCheck
keyword: Guess=TCheck
keyword: SCRF=Check
keyword: GenChk
keyword: RB3LYP/ChkBas
keyword: Freq
converged: YES YES YES YES
title: Mulliken charges:
elementType: C C C C C C C C C C H C C H H H H H H H N N Cu C C C C C C H C H C H H H
charge: -0.163163 -0.157394 0.143399 0.222120 0.021868 -0.198484 0.237628 0.144960 -0.200363 -0.157639 0.195593 -0.162283 0.030426 0.181369 0.188545 0.194025 0.204447 0.181592 0.190463 0.210349 -0.476192 -0.449558 -0.091367 -0.027766 -0.235891 0.021332 -0.177715 -0.177628 -0.160178 0.157623 -0.160106 0.157575 -0.156942 0.156988 0.157032 0.155331
chargesum: 0.00000
title: Mulliken charges with hydrogens summed into heavy atoms:
elementType: C C C C C C C C C C C C N N Cu C C C C C C C C
charge: 0.025382 0.036631 0.143399 0.222120 0.226315 -0.017115 0.237628 0.144960 -0.018770 0.037955 0.028180 0.240775 -0.476192 -0.449558 -0.091367 -0.027766 -0.235891 0.021332 -0.020091 -0.020052 -0.003191 -0.003074 -0.001611
polarizability: 5.30704239e+02 -5.99793277e+01 4.26115126e+02 3.63561965e+01 -2.59203518e+01 2.11989746e+02
1716.lowfreq: -8.3929 0.0005 0.0008 0.0010 6.3907 14.9249 21.1941 23.0672 25.8951
frequency: 13.8245 19.0869 23.5381 53.2727 77.2433 91.4333 94.9371 124.7294 137.7615 155.9757 223.9334 237.6512 245.0304 256.1715 268.2810 284.5884 387.9059 415.4556 419.2558 428.6309 451.7431 485.8413 514.4781 519.8029 521.9990 551.2064 560.3034 561.7551 567.3304 620.4238 634.1543 647.9900 708.9148 736.5310 738.7492 745.3651 777.4107 787.7377 805.7077 820.3486 847.7161 857.2605 866.8132 878.5249 912.7997 925.9288 973.9155 974.8442 975.6998 993.2190 1002.1579 1009.3279 1009.5171 1014.6586 1053.5584 1053.9393 1078.6435 1107.6588 1110.6336 1126.2172 1169.2719 1180.8710 1190.1033 1209.0659 1238.4090 1240.1008 1241.0340 1256.3805 1293.1198 1319.3946 1349.4253 1361.9449 1367.2321 1381.9694 1452.1686 1453.9066 1463.4084 1482.7269 1491.8588 1532.3484 1540.3677 1557.9004 1617.5840 1623.3106 1640.2836 1649.8251 1655.0620 1671.0143 2161.0750 3186.0710 3191.1958 3202.2265 3202.2618 3206.6468 3208.7763 3210.9884 3213.0145 3215.5126 3217.5618 3223.9196 3234.0036 3239.2120
redmass: 5.9395 6.8177 4.4953 5.8945 8.6405 6.7304 5.7370 7.8361 4.7437 7.1373 6.8829 3.6328 8.6033 5.2298 15.2335 5.4826 6.1349 2.9926 3.9336 7.1071 3.9216 6.7692 3.4281 4.6423 7.6290 3.5772 8.7550 3.0622 7.5305 3.8325 6.5877 8.1808 1.9277 6.4593 6.4178 3.4652 1.8064 1.1969 6.2969 1.3528 6.9179 1.2503 1.6577 6.4528 5.2804 1.4214 1.3805 1.3480 1.3983 1.3127 1.2568 1.3559 6.1712 1.3596 5.2434 2.2354 2.4887 1.6062 2.3181 2.0886 1.2362 1.2129 1.0903 1.1339 3.7624 2.9684 1.6397 1.8156 1.7967 3.4446 3.8773 1.6948 6.6342 2.2214 3.6658 1.9285 2.2832 2.2207 3.0801 2.1628 3.2632 4.2798 5.0244 6.3131 5.6303 5.4832 6.5704 6.5028 11.9980 1.0858 1.0881 1.0917 1.0878 1.0950 1.0898 1.0906 1.0922 1.0983 1.0969 1.0914 1.0973 1.0974
irintensity: 0.8121 1.9529 0.1269 9.9064 13.1828 0.6413 1.3716 0.0643 0.6216 2.6599 17.0328 6.7390 24.2341 1.7758 4.6203 12.5244 1.6837 0.0023 0.0379 9.4882 0.3096 1.2799 0.2574 2.7878 2.6568 6.2239 1.7735 0.0149 0.9170 0.0115 0.0222 15.6396 31.0846 14.7647 11.6691 63.6574 68.3286 12.8932 6.9597 0.0025 0.3166 0.0351 95.1925 12.3623 2.5619 7.2443 0.2310 0.0476 0.9244 0.0711 0.2312 1.7713 1.2214 0.7687 0.6884 11.4110 0.1015 13.9154 1.5086 22.7702 17.2419 3.7588 0.2504 4.9218 43.6392 1.8446 0.2114 6.9648 0.1011 0.0080 0.0893 0.1393 8.7567 5.1564 11.8311 8.2522 102.6202 2.9084 0.2693 74.6954 25.0793 114.5555 6.2106 39.3882 13.7795 78.2994 1.1855 17.7133 213.0814 8.7477 1.9011 18.5760 0.3438 55.9137 7.5959 4.7611 5.9847 28.7345 25.0365 3.7640 16.9115 14.8452
temp: 298.150 k
press: 1.00000 atm
elementType: 6 6 6 6 6 6 6 6 6 6 1 6 6 1 1 1 1 1 1 1 7 7 29 6 6 6 6 6 6 1 6 1 6 1 1 1
symmnumber: 1
zpe: 717951.3 jmol-1
zpe.correction: 0.273453 hartree
zpe.thermalcorrener: 0.292227 hartree
zpe.thermalcorrenthalpy: 0.293171 hartree
zpe.thermalcorrgfe: 0.222461 hartree
zpe.sumelectzpe: -1076.608826 hartree
zpe.sumelectthermal: -1076.590052 hartree
zpe.sumelectthermalent: -1076.589108 hartree
zpe.sumelectthermalfe: -1076.659818 hartree
dipole: 12.6098 -7.6188 1.8131
dipole: 14.8439
quadrupole: -204.2176 -88.7196 -137.6408
quadrupole: 17.3637 -8.4620 -1.8547
quadrupole: -60.6916 54.8064 5.8851 17.3637 -8.4620 -1.8547
hfenergy: -1076.882279 hartree
pointgroup: C01 [X(C20H13Cu1N2)]
dipole: 4.9610831 -2.997451 0.7133143 debye
polarizability: 530.7042386|-59.9793277|426.1151257|36.3561965|-25.9203518|211.9897462 unknown
InChI: InChI=1/C12H8N2.C8H5.Cu/c1-3-9-5-6-10-4-2-8-14-12(10)11(9)13-7-1;1-2-8-6-4-3-5-7-8;/h1-8H;3-7H;/q-2;;+2/rC20H13CuN2/c1-2-6-16(7-3-1)12-13-21-22-14-4-8-17-10-11-18-9-5-15-23(21)20(18)19(17)22/h1-11,14-15H
charge 0 multiplicity 1
36 atoms
C  -3.95561941 -5.23536112 -0.10119059
C  -2.59165121 -5.36800357 0.07474954
C  -1.77609276 -4.21320452 0.08081296
C  -2.42008301 -2.96443475 -0.09734005
C  -4.50141033 -3.94787004 -0.27022284
C  -0.35117089 -4.25329915 0.25391543
C  -1.63793252 -1.75217029 -0.09856339
C  -0.23411161 -1.82491736 0.07248079
C  0.38849852 -3.10716578 0.2493089
C  0.48543685 -0.60829949 0.06232229
H  1.56409705 -0.62329526 0.19154889
C  -0.19506214 0.58168041 -0.11022577
C  -1.59261834 0.55421341 -0.27104265
H  0.12505001 -5.2204567 0.38867007
H  -4.61018138 -6.10053669 -0.11133277
H  -2.13578084 -6.34522464 0.20800832
H  -5.56973186 -3.80966917 -0.41059783
H  1.46626564 -3.14174382 0.38085081
H  0.32555246 1.53324112 -0.12300495
H  -2.15724567 1.47106214 -0.40718469
N  -2.29789707 -0.57515329 -0.26587895
N  -3.76064543 -2.84461725 -0.26898
Cu -4.35853137 -0.74465608 -0.46408443
C  -5.99837614 0.10597427 -0.65529317
C  -7.09256296 0.66308457 -0.7890307
C  -8.35788762 1.31014346 -0.94169437
C  -8.86061836 1.62611012 -2.22381695
C  -9.1390525 1.65172403 0.18512625
C  -10.09487312 2.25789163 -2.36885067
H  -8.27224086 1.37081365 -3.10096543
C  -10.37236396 2.28330443 0.03140659
H  -8.76752463 1.41536158 1.1785287
C  -10.85750406 2.59000672 -1.24424997
H  -10.4626657 2.49252358 -3.3646364
H  -10.95758023 2.53698806 0.91181575
H  -11.81899958 3.0828248 -1.36077271
