program: Gaussian 09
title: Title Card Required
version: ES64L-G09RevD.01
method: RB3LYP
basis: Gen
operation: Freq
keyword: #P
keyword: Geom=AllCheck
keyword: Guess=TCheck
keyword: SCRF=Check
keyword: GenChk
keyword: RB3LYP/ChkBas
keyword: Freq
converged: YES YES NO NO
title: Mulliken charges:
elementType: Br C C C C O N H H H H H H H C C C C H C H C H H H C C C C C C C C C C H C C H H H H H H H N N Cu C C C C C C H C H C H H H
charge: -0.871847 0.152403 0.586892 -0.526469 -0.517936 -0.487075 -0.648835 0.212312 0.226336 0.214779 0.237958 0.195757 0.205547 0.390883 0.341398 -0.220840 -0.190237 -0.155590 0.172421 -0.166913 0.181211 -0.157424 0.159720 0.158988 0.154593 -0.160789 -0.161464 0.148347 0.231150 0.022040 -0.198215 0.232548 0.150182 -0.199465 -0.162911 0.196027 -0.159630 0.018456 0.181840 0.189342 0.194751 0.207730 0.181825 0.190588 0.210479 -0.470306 -0.461797 0.019539 -0.010402 -0.123561 -0.004012 -0.154356 -0.154450 -0.155515 0.174234 -0.156257 0.173438 -0.140222 0.167536 0.167444 0.167824
chargesum: 0.00000
title: Mulliken charges with hydrogens summed into heavy atoms:
elementType: Br C C C C O N C C C C C C C C C C C C C C C C C C N N Cu C C C C C C C C
charge: -0.871847 0.152403 0.586892 0.126958 0.121326 -0.487075 -0.257951 0.341398 -0.048418 -0.009026 0.004130 -0.007925 -0.002832 0.028553 0.033287 0.148347 0.231150 0.229770 -0.016376 0.232548 0.150182 -0.017640 0.033116 0.030957 0.228935 -0.470306 -0.461797 0.019539 -0.010402 -0.123561 -0.004012 0.019878 0.018988 0.012021 0.011187 0.027602
polarizability: 5.67888429e+02 7.74539934e+01 6.73169142e+02 2.02917385e+02 -3.18664987e+01 7.42325879e+02
1716.lowfreq: -179.5083 -4.0980 0.0002 0.0005 0.0007 5.8834 7.9257 15.5564 20.3312
frequency: -179.5078 14.4309 19.4535 23.3872 32.9473 37.3312 41.0914 50.6977 55.0702 58.4957 72.6363 78.8077 84.1151 99.7844 104.2217 117.2975 121.1057 127.3779 135.7122 143.7982 147.3333 155.5172 176.1814 215.1444 229.5446 241.0803 241.9909 255.6662 258.0553 267.5383 276.9484 288.1832 296.8973 341.3128 361.0737 380.2079 392.3519 412.9739 415.4423 420.4874 429.6052 439.4913 448.4387 485.8811 513.4209 514.5828 518.0732 521.2071 547.1532 555.6846 559.3272 562.6022 566.3153 569.0748 618.8272 623.1931 630.5305 632.4749 649.3811 686.9165 700.4245 702.9113 738.1121 738.4618 744.1508 768.9739 781.2940 786.8142 807.6096 819.2688 836.8586 842.6036 846.4107 858.9035 865.5980 879.9496 887.3361 911.2609 912.7058 914.2204 942.3041 970.5396 974.0480 975.8274 979.1502 983.2452 991.0607 991.3951 1003.9776 1008.4223 1011.1829 1012.1512 1012.3564 1013.2806 1050.8020 1052.9908 1055.9348 1059.5581 1081.5872 1110.7597 1112.9210 1121.5239 1127.8518 1170.5729 1181.0440 1188.1536 1193.2287 1193.9916 1207.2245 1216.0292 1240.6766 1240.9953 1242.5725 1256.8268 1272.7280 1287.4533 1294.2197 1308.3883 1326.0374 1349.1579 1356.7146 1363.0127 1367.2896 1371.5269 1382.6175 1398.2666 1402.2528 1452.8899 1454.8914 1461.4530 1464.1671 1479.9297 1481.9299 1483.3112 1488.1291 1492.4528 1510.9406 1529.2425 1540.9552 1543.3025 1559.0090 1589.9021 1616.5767 1624.6211 1640.2234 1646.6702 1652.5351 1654.4821 1658.0419 1670.3485 1731.5375 2108.7980 3048.6598 3064.9818 3123.3460 3127.1316 3184.3343 3186.6927 3187.3500 3195.4264 3195.7242 3201.9316 3202.9253 3206.3093 3210.8698 3211.7476 3212.1193 3217.4565 3217.7685 3218.3214 3219.0748 3223.2951 3224.5200 3236.7866 3239.2462 3268.9770 3617.7593
redmass: 5.4840 7.6422 7.6871 6.7369 5.6852 7.9390 3.8519 5.8055 7.9149 6.2451 6.8762 4.9665 6.9267 5.2145 5.9107 5.5866 7.2288 7.2417 7.9321 4.6707 4.4220 5.8699 2.0152 1.8679 1.8059 2.9080 2.4475 4.9642 3.7894 10.5063 3.6468 5.1745 4.9731 3.7300 3.1084 5.7769 3.8123 2.9438 3.9305 3.0666 7.1180 3.1136 3.9773 6.7693 2.8490 2.9574 6.9329 4.6816 4.4684 4.4263 3.2108 5.6814 1.5401 5.8317 3.8640 4.9781 6.4207 6.6078 8.1682 6.7258 2.1353 1.8465 6.1501 6.3593 3.6568 1.6950 1.8436 1.1951 6.2573 1.3668 4.6157 1.3046 6.3045 1.2490 1.6517 6.4484 4.5583 1.4423 1.2891 5.2139 1.3905 1.3399 1.3798 1.4991 2.0380 1.3597 1.2961 1.2699 1.3485 1.3555 4.0366 1.4434 5.7434 1.3574 1.7233 2.1362 5.0161 2.1221 2.5040 1.5959 2.2999 1.5746 2.0979 1.2398 1.2144 1.6033 1.0918 1.5580 1.1529 1.1552 3.3781 3.6862 1.5363 1.8107 3.2073 2.4970 1.8036 3.1446 2.9264 3.8652 2.4078 1.8809 6.6112 2.2515 2.2149 1.2528 1.1727 3.8646 1.9290 1.0458 2.2283 1.0944 2.1849 2.0213 1.1313 2.9906 1.1330 2.1386 3.2376 2.2773 4.2971 1.9647 4.9014 6.3187 5.5786 5.4214 4.1703 6.5311 3.9685 6.5033 8.5367 11.9664 1.0473 1.0415 1.0930 1.0872 1.1043 1.0886 1.0989 1.0864 1.0878 1.0887 1.0878 1.0925 1.0924 1.0899 1.0904 1.0921 1.0951 1.0968 1.0975 1.0981 1.0909 1.0974 1.0973 1.0922 1.0774
irintensity: 922.1026 5.1685 2.6947 0.4538 2.9167 3.7837 0.7800 0.5196 1.4501 2.3252 0.1459 2.6497 14.0654 2.1372 9.0309 7.2762 1.4083 4.0667 13.1402 20.0345 9.7134 14.5532 46.3080 29.2935 2.7640 2.5816 12.1682 0.4422 10.4202 12.0861 6.9951 10.8113 22.1957 10.4625 45.4287 6.8632 35.6400 0.1631 0.2122 0.3780 8.0208 39.2096 2.3579 0.8106 26.2938 17.2509 3.9468 2.9946 27.8156 41.1621 1.6883 1.8330 108.5835 6.5445 0.0512 1.4215 1.1512 0.0188 14.0373 6.1051 36.4045 42.8070 14.9847 13.1581 71.3337 93.3713 79.9130 13.8651 4.7484 0.3999 0.1489 1.5647 0.1187 0.1302 98.4424 12.2941 30.7034 3.4151 18.3731 2.1881 12.5554 0.1847 0.9237 9.5344 70.9742 0.9751 0.3405 0.7890 7.0900 0.5065 7.0120 0.2682 1.7942 1.2538 272.5583 24.5344 4.3272 20.0878 0.4345 12.6605 0.7731 21.7483 18.3915 17.5402 2.4900 66.9958 0.3198 72.4103 10.3151 0.1691 2.9037 4.2756 1.2634 8.1821 69.0622 74.8690 0.2876 39.3371 1.9445 0.3404 146.6568 1.8423 10.0797 5.7524 5.3320 98.6048 73.4775 12.9776 11.4147 3.2914 97.6862 12.3201 9.9484 96.8440 34.1991 0.3855 21.7490 12.2341 25.3821 159.5962 108.8290 312.7933 2.9121 41.2093 14.3007 14.0975 157.9739 0.9659 11.2522 18.5361 316.7088 561.5199 27.2262 7.5288 8.3328 5.7061 1.3506 8.5997 9.8521 2.3741 1.8711 3.0368 0.4392 32.3217 19.8410 5.9389 5.0409 8.4014 33.5104 20.6785 42.0681 29.2620 4.3964 18.2224 13.8204 1.4099 79.3566
temp: 298.150 k
press: 1.00000 atm
elementType: 35 6 6 6 6 8 7 1 1 1 1 1 1 1 6 6 6 6 1 6 1 6 1 1 1 6 6 6 6 6 6 6 6 6 6 1 6 6 1 1 1 1 1 1 1 7 7 29 6 6 6 6 6 6 1 6 1 6 1 1 1
symmnumber: 1
zpe: 1249144.7 jmol-1
zpe.correction: 0.475774 hartree
zpe.thermalcorrener: 0.508998 hartree
zpe.thermalcorrenthalpy: 0.509942 hartree
zpe.thermalcorrgfe: 0.407172 hartree
zpe.sumelectzpe: -1608.106457 hartree
zpe.sumelectthermal: -1608.073233 hartree
zpe.sumelectthermalent: -1608.072288 hartree
zpe.sumelectthermalfe: -1608.175059 hartree
dipole: 13.9732 -13.8570 -1.3722
dipole: 19.7269
quadrupole: -298.7471 -235.2618 -188.4577
quadrupole: 78.2108 51.8963 -45.8622
quadrupole: -57.9249 5.5604 52.3645 78.2108 51.8963 -45.8622
hfenergy: -1608.5822307 hartree
pointgroup: C01 [X(C30H25Br1Cu1N3O1)]
dipole: 5.4974812 -5.4517553 -0.5398496 debye
polarizability: 567.888429|77.4539934|673.1691416|202.9173852|-31.8664987|742.3258786 unknown
InChI: InChI=1/C12H8N2.C10H12NO.C8H5.Br.Cu/c1-3-9-5-6-10-4-2-8-14-12(10)11(9)13-7-1;1-8(2)10(12)11-9-6-4-3-5-7-9;1-2-8-6-4-3-5-7-8;;/h1-8H;3-7,11H,1-2H3;3-7H;;/q-2;;;;+2/rC20H13CuN2.C10H12NO.Br/c1-2-6-16(7-3-1)12-13-21-22-14-4-8-17-10-11-18-9-5-15-23(21)20(18)19(17)22;1-8(2)10(12)11-9-6-4-3-5-7-9;/h1-11,14-15H;3-7,11H,1-2H3;
charge 0 multiplicity 1
61 atoms
Br -5.552626 3.930336 0.776882
C  -5.301428 1.743098 -1.49646
C  -5.49098816 0.83997392 -0.28603089
C  -4.024865 2.4073694 -1.89748399
C  -6.54023071 2.15707583 -2.19225649
O  -6.53801652 0.21057922 -0.15043811
N  -4.42431386 0.7647955 0.56625492
H  -3.91652647 2.34915977 -2.98446238
H  -4.08760576 3.468553 -1.63130238
H  -3.13800116 1.97055784 -1.43832859
H  -6.88214707 3.07439499 -1.69275884
H  -6.35312871 2.40114317 -3.24073333
H  -7.3313492 1.41235504 -2.09568162
H  -3.71876899 1.4827125 0.467487
C  -4.29002083 -0.02313978 1.7197549
C  -3.25688039 0.31824026 2.6119195
C  -5.07706026 -1.15910008 1.97708695
C  -3.0161632 -0.46021709 3.74091714
H  -2.63369384 1.18438473 2.40246497
C  -4.81871722 -1.93246476 3.11043693
H  -5.87137151 -1.42861086 1.29566183
C  -3.79425576 -1.59343587 3.99768395
H  -2.20821482 -0.18660513 4.4134086
H  -5.42547724 -2.81543995 3.29317681
H  -3.59874845 -2.20668991 4.8726606
C  -3.09390095 -4.77504198 1.06753089
C  -2.13778463 -4.52953239 2.03443415
C  -1.382562 -3.33606599 1.97895923
C  -1.6583933 -2.44313996 0.91558254
C  -3.29380097 -3.826388 0.04714244
C  -0.38188983 -2.98929902 2.94828543
C  -0.94221293 -1.19380362 0.82778408
C  0.03624407 -0.87935674 1.80171437
C  0.30059758 -1.81135528 2.86153978
C  0.68703057 0.36970844 1.688216
H  1.43907413 0.6497129 2.42052144
C  0.35251834 1.21829742 0.64994398
C  -0.63232071 0.81655502 -0.27148035
H  -0.18587839 -3.68564351 3.75864251
H  -3.69272135 -5.67943006 1.08311482
H  -1.96063135 -5.23732959 2.83930737
H  -4.04103147 -3.98364391 -0.72478635
H  1.05236675 -1.54975796 3.60062535
H  0.83130209 2.18475531 0.53367825
H  -0.91810218 1.4606679 -1.09679296
N  -1.26557199 -0.35093055 -0.18787855
N  -2.59921886 -2.69529792 -0.02945489
Cu -2.91558859 -1.02267809 -1.3067628
C  -4.253004 -0.494587 -2.481175
C  -5.18060255 -0.29703594 -3.28823302
C  -6.20889798 -0.14213166 -4.25577481
C  -7.49229627 -0.69041912 -4.03237269
C  -5.97447975 0.59124639 -5.44112159
C  -8.50579715 -0.51022726 -4.96997484
H  -7.67814756 -1.24827531 -3.11966783
C  -6.99450663 0.76359237 -6.37369944
H  -4.99068508 1.01700015 -5.61528055
C  -8.26078365 0.21527952 -6.14132369
H  -9.48921814 -0.93504859 -4.78846794
H  -6.80390486 1.32763181 -7.28260492
H  -9.05423401 0.35255728 -6.87085888
