program: Gaussian 09
title: Title Card Required
version: ES64L-G09RevD.01
method: RB3LYP
basis: Gen
operation: Freq
keyword: #P
keyword: Geom=AllCheck
keyword: Guess=TCheck
keyword: SCRF=Check
keyword: GenChk
keyword: RB3LYP/ChkBas
keyword: Freq
converged: YES YES NO YES
title: Mulliken charges:
elementType: Br C C C C O N H H H H H H H C C C C H C H C H H H C C C C C C C C C C H C C H H H H H H H N N Cu C C C C C C H C H C H H H
charge: -0.877293 0.202079 0.584295 -0.558133 -0.519280 -0.485919 -0.652328 0.214370 0.244489 0.244874 0.244641 0.206150 0.223109 0.401801 0.325571 -0.211123 -0.179519 -0.154651 0.178148 -0.167686 0.187271 -0.149603 0.164617 0.163112 0.160386 -0.157582 -0.162568 0.154094 0.245678 0.047142 -0.200126 0.199257 0.145120 -0.195718 -0.161969 0.193793 -0.160863 0.011558 0.182252 0.191995 0.196980 0.215906 0.181065 0.187871 0.201894 -0.430365 -0.505616 0.002328 0.013257 -0.203863 0.013330 -0.169608 -0.172970 -0.158143 0.164987 -0.156909 0.164979 -0.149998 0.161508 0.161265 0.160661
chargesum: 0.00000
title: Mulliken charges with hydrogens summed into heavy atoms:
elementType: Br C C C C O N C C C C C C C C C C C C C C C C C C N N Cu C C C C C C C C
charge: -0.877293 0.202079 0.584295 0.145599 0.154620 -0.485919 -0.250527 0.325571 -0.032975 0.007751 0.009966 -0.004574 0.010783 0.034412 0.034412 0.154094 0.245678 0.263049 -0.017874 0.199257 0.145120 -0.014653 0.031824 0.027009 0.213452 -0.430365 -0.505616 0.002328 0.013257 -0.203863 0.013330 -0.004621 -0.007991 0.003364 0.004355 0.010664
polarizability: 6.72266270e+02 -2.28015161e-01 5.96802936e+02 1.13770265e+02 -1.23055406e+02 8.72098842e+02
1716.lowfreq: -91.8799 -1.3449 -0.0003 0.0002 0.0006 8.6628 10.3051 15.3788 20.1213
frequency: -91.5431 14.0679 19.2262 22.3547 23.1235 27.2986 34.2445 38.2317 59.8676 72.0701 75.0649 81.1186 86.6687 90.1643 110.7210 112.9760 119.6338 127.2203 134.5607 137.2200 143.1219 146.6514 168.6054 193.3245 217.5275 223.9103 242.2474 261.2305 261.7706 275.7915 278.6106 289.5258 301.7179 332.9833 339.9944 386.3607 404.7200 414.0945 418.6120 420.0714 428.0253 447.5325 451.6976 485.5975 512.9924 516.9904 520.9287 527.4129 558.2312 561.2422 564.5006 566.8929 571.3140 602.5310 618.8717 628.2165 630.4506 633.7277 650.9120 686.2380 699.5166 707.4852 735.8300 741.8946 743.0832 774.5974 780.4190 783.1338 810.7632 815.4290 831.6452 843.6618 847.0625 859.7567 863.4304 868.1741 874.4005 878.5272 916.8054 919.7803 934.5239 951.4553 962.1132 975.0853 975.5280 979.2276 987.4284 999.0007 1005.2972 1007.5182 1010.7413 1011.7458 1012.2472 1034.9117 1054.1322 1054.6261 1057.1159 1066.0476 1080.6736 1109.3118 1114.1725 1121.4526 1129.0047 1171.0400 1181.1337 1188.4852 1191.5682 1197.4307 1209.8665 1215.1604 1240.9497 1241.8364 1243.4694 1257.0393 1273.6956 1290.1306 1296.4432 1310.6633 1322.7331 1349.7284 1359.1398 1362.5103 1366.4302 1373.6759 1375.5353 1384.7150 1397.2671 1449.3661 1449.4218 1455.1569 1465.0658 1467.1007 1482.9256 1483.4872 1486.0943 1492.1857 1516.3477 1532.9420 1540.6924 1540.9403 1559.9440 1605.3998 1618.3451 1624.0935 1640.8951 1649.7096 1653.2501 1654.7828 1668.1185 1670.3852 1717.4659 2175.6382 3023.3883 3045.5497 3119.5102 3133.6087 3180.8625 3190.2459 3191.5591 3195.8295 3197.2459 3202.1203 3202.4578 3203.5599 3205.3903 3207.2543 3210.6590 3211.2654 3214.0230 3218.4896 3218.7976 3219.0669 3233.5146 3234.0108 3247.1420 3282.8355 3626.0610
redmass: 6.0965 7.3585 5.8696 6.8162 4.8330 10.3193 7.2264 5.6731 4.5474 5.2383 5.9819 5.7956 4.8000 5.8695 6.0474 5.5879 7.8250 2.5256 2.4097 2.8637 6.4804 4.5729 3.9801 1.8907 2.2526 4.7040 3.5570 4.4127 5.7715 3.9766 4.2914 6.4660 7.5755 3.1310 3.0270 5.1579 5.5604 2.9846 3.8760 3.0992 7.0380 3.0802 3.9382 6.7708 3.3329 2.6448 4.6634 7.8958 3.0662 4.0222 4.7297 7.3618 8.1381 1.3334 3.8021 5.2893 6.3684 6.6060 8.1202 5.5529 2.0554 1.9263 6.3224 3.7971 5.3987 1.7338 1.8035 1.2114 6.3082 1.3804 3.8323 5.3756 1.3030 1.2472 1.6667 1.4452 3.0748 6.4002 5.2297 1.4230 1.4053 2.9819 1.4160 1.3401 1.3754 1.3503 1.3168 1.2604 1.3577 1.2671 6.1643 1.3597 5.9613 1.3182 2.2357 5.3003 2.1680 1.6424 2.5182 1.6029 2.2883 1.5726 2.1014 1.2398 1.2125 1.3965 1.0904 1.9107 1.1352 1.1829 3.2753 1.5671 3.8270 1.8171 3.4715 2.5002 1.8106 3.1090 3.3544 3.8604 1.8999 1.7223 6.1261 2.2748 1.3256 2.3024 1.2010 3.2814 1.1361 1.8538 2.2742 1.0571 2.2005 1.6304 1.4150 2.8840 1.1986 2.1664 2.2519 3.2299 4.2731 2.5100 5.0236 6.2641 5.5345 5.4593 5.2228 6.3826 2.3060 6.4767 5.9515 11.9991 1.0555 1.0461 1.0892 1.0739 1.1016 1.0859 1.0874 1.0881 1.0891 1.0928 1.1030 1.0880 1.0918 1.0933 1.0952 1.0912 1.0909 1.0984 1.0978 1.0969 1.0970 1.0924 1.0970 1.0923 1.0767
irintensity: 555.1505 1.6089 0.7794 5.6539 2.9457 11.3646 11.3161 1.2877 1.3593 2.7525 0.9205 4.1625 0.5408 27.2826 21.3040 16.1718 98.4943 0.5665 19.4160 1.2547 34.6841 4.1323 2.1202 23.4456 14.5894 150.8674 2.6989 26.2212 5.5270 14.6378 5.2823 1.2949 23.6189 92.6250 191.5736 33.5010 8.5386 0.1012 0.3108 0.2982 9.1988 21.7704 1.1769 1.4494 1.2354 6.7022 2.2880 2.5960 0.1016 26.2358 39.7406 0.8729 2.1299 81.1614 3.2885 11.1886 2.2052 0.0174 17.9672 9.3585 37.5149 34.9053 15.5914 61.6602 30.4621 92.8080 76.0102 15.0117 30.4232 0.6447 17.2911 0.4782 0.7122 0.0215 90.8493 13.9383 19.2271 13.4145 3.1191 19.3019 9.6000 39.8475 3.2069 0.2497 0.3227 0.0211 0.1345 0.9591 1.3509 0.4954 1.3323 1.3330 2.3832 15.1272 14.0010 0.8780 8.2790 318.5508 0.7415 12.7810 2.1131 20.3460 22.4939 17.3978 3.9583 19.1862 0.0338 38.7223 0.5128 13.4576 0.8287 3.2775 17.0904 9.6358 85.5864 36.6827 0.5043 138.8350 0.4011 1.2941 20.5393 0.3455 8.1028 21.8599 135.9834 8.2219 68.4768 13.4014 2.7614 6.5173 103.7136 6.5142 8.7464 75.0074 6.6321 3.5238 25.9869 37.8865 60.1276 27.0874 121.4896 64.3306 4.2747 39.8086 13.1219 4.3689 9.7139 2.0941 174.3523 17.8938 247.5127 42.0292 48.0533 28.5516 22.2266 23.9422 5.6025 5.4981 4.5811 1.4892 2.3159 9.7632 13.3056 0.7807 13.8989 30.6475 48.6904 6.2654 3.7098 46.6743 25.2352 37.4487 17.5878 4.2449 5.9694 6.5709 87.9888
temp: 298.150 k
press: 1.00000 atm
elementType: 35 6 6 6 6 8 7 1 1 1 1 1 1 1 6 6 6 6 1 6 1 6 1 1 1 6 6 6 6 6 6 6 6 6 6 1 6 6 1 1 1 1 1 1 1 7 7 29 6 6 6 6 6 6 1 6 1 6 1 1 1
symmnumber: 1
zpe: 1248988.8 jmol-1
zpe.correction: 0.475715 hartree
zpe.thermalcorrener: 0.509049 hartree
zpe.thermalcorrenthalpy: 0.509994 hartree
zpe.thermalcorrgfe: 0.406021 hartree
zpe.sumelectzpe: -1608.101147 hartree
zpe.sumelectthermal: -1608.067813 hartree
zpe.sumelectthermalent: -1608.066868 hartree
zpe.sumelectthermalfe: -1608.170841 hartree
dipole: 19.9457 -9.5962 -0.0749
dipole: 22.1342
quadrupole: -389.1685 -215.2802 -216.6012
quadrupole: 71.8953 48.9481 -50.5457
quadrupole: -115.4852 58.4031 57.0821 71.8953 48.9481 -50.5457
hfenergy: -1608.576862 hartree
pointgroup: C01 [X(C30H25Br1Cu1N3O1)]
dipole: 7.8472372 -3.7754458 -0.0294625 debye
polarizability: 672.2662698|-0.2280152|596.8029364|113.7702649|-123.0554058|872.0988417 unknown
InChI: InChI=1/C12H8N2.C10H12NO.C8H5.Br.Cu/c1-3-9-5-6-10-4-2-8-14-12(10)11(9)13-7-1;1-8(2)10(12)11-9-6-4-3-5-7-9;1-2-8-6-4-3-5-7-8;;/h1-8H;3-7,11H,1-2H3;3-7H;;/q-1;;;;+1/rC20H13CuN2.C10H12NO.Br/c1-2-6-16(7-3-1)12-13-21-23-15-5-9-18-11-10-17-8-4-14-22-19(17)20(18)23;1-8(2)10(12)11-9-6-4-3-5-7-9;/h1-11,14-15H;3-7,11H,1-2H3;
charge 0 multiplicity 1
61 atoms
Br -7.55850131 2.48482243 1.64037655
C  -6.03624199 0.48700882 -0.50273756
C  -5.738005 -0.23622758 0.79347831
C  -5.24102235 1.6516342 -0.98102646
C  -7.30037365 0.11099046 -1.16821088
O  -6.46188515 -1.15936377 1.17088943
N  -4.63025345 0.21244094 1.45554251
H  -5.553098 1.95419305 -1.98061273
H  -5.40340269 2.48735121 -0.28770264
H  -4.16845908 1.43398489 -0.99828016
H  -8.09268268 0.68081167 -0.6577351
H  -7.30010359 0.38464886 -2.22234508
H  -7.52996708 -0.94663662 -1.02477713
H  -4.10802359 0.96731416 1.02874849
C  -4.11494261 -0.22379945 2.68208694
C  -2.90015985 0.35696201 3.09866175
C  -4.72779997 -1.20377012 3.48359933
C  -2.30490264 -0.04293367 4.28968816
H  -2.42477128 1.10853483 2.47342456
C  -4.1143946 -1.59314898 4.67501201
H  -5.65559959 -1.65427638 3.16517664
C  -2.9067141 -1.02455504 5.08561439
H  -1.36324702 0.4063091 4.59184919
H  -4.59056052 -2.35622835 5.28475542
H  -2.43755405 -1.34161543 6.01250999
C  -3.98086834 -4.32726824 1.81868283
C  -2.7622764 -4.10032517 2.42749494
C  -1.93106281 -3.05942098 1.95637127
C  -2.39454247 -2.29396735 0.85854929
C  -4.36274354 -3.51902036 0.73464747
C  -0.66337338 -2.74545646 2.55262387
C  -1.59097021 -1.20057304 0.3638742
C  -0.35079627 -0.90878663 0.98689651
C  0.0968676 -1.71383393 2.08710969
C  0.38039589 0.19282242 0.48643732
H  1.3322917 0.45264331 0.94133048
C  -0.12745412 0.92440565 -0.57003541
C  -1.36489271 0.54613037 -1.12782286
H  -0.32950171 -3.34633027 3.39349976
H  -4.64799533 -5.11075742 2.16103622
H  -2.43636103 -4.70358858 3.26997949
H  -5.31392009 -3.66270548 0.23545669
H  1.05079668 -1.47458236 2.54841167
H  0.40716294 1.77731965 -0.97494569
H  -1.79006554 1.095167 -1.96409533
N  -2.0749161 -0.4805067 -0.67671708
N  -3.59380946 -2.53894752 0.26149255
Cu -4.08700062 -1.45663712 -1.34962294
C  -4.80100903 -0.83058009 -2.93650072
C  -5.22357498 -0.34759765 -3.98782927
C  -5.74452004 0.2455281 -5.17746434
C  -7.01367933 -0.12662798 -5.67285869
C  -5.01122449 1.23324233 -5.87121341
C  -7.52862805 0.47312157 -6.82087093
H  -7.58572238 -0.88681774 -5.14828948
C  -5.53366531 1.8277011 -7.01825745
H  -4.03359195 1.52696832 -5.49909078
C  -6.79275936 1.45123242 -7.49800959
H  -8.50730542 0.17616439 -7.18876382
H  -4.95725142 2.58761185 -7.53945085
H  -7.19721809 1.91647638 -8.39287051
