program: Gaussian 09
title: Title
version: ES64L-G09RevD.01
method: UB3LYP
basis: Gen
operation: Freq
keyword: #P
keyword: Geom=AllCheck
keyword: Guess=TCheck
keyword: SCRF=Check
keyword: GenChk
keyword: UB3LYP/ChkBas
keyword: Freq
converged: YES YES NO YES
polarizability: 4.95262050e+02 6.16348924e+00 6.00679739e+02 2.02125155e+02 -6.94674965e+01 6.79638820e+02
1716.lowfreq: -163.3570 -0.0060 -0.0033 -0.0025 3.2891 7.7096 8.3777 11.7821 13.5687
frequency: -163.3563 10.6563 11.8328 19.6025 24.3589 25.1029 27.7663 32.3919 39.6423 56.8896 66.4277 76.0083 90.2120 96.8627 104.0460 108.0691 121.3558 125.6932 133.9082 144.2513 165.6978 171.0642 178.2144 199.4569 205.3640 241.6154 249.0726 255.2232 257.3603 270.6001 272.3773 273.1974 296.0416 308.9497 330.9165 374.1430 404.5944 416.1647 421.1872 422.3384 427.9321 435.1234 455.4421 490.5058 516.2044 518.6268 521.6674 526.4153 555.4631 561.3079 563.5039 569.1203 572.2105 574.2543 619.3755 627.2060 633.6413 635.7390 651.1027 706.2491 708.5035 721.2966 736.3831 741.3900 744.2634 772.1422 776.8452 790.2692 806.5024 824.5748 839.3747 843.9069 847.8599 857.3810 869.4517 880.1332 882.0496 909.8095 914.4637 924.0057 963.0321 964.5600 968.7618 980.9613 984.8012 990.9818 992.8773 994.3144 1003.7379 1012.3351 1013.0899 1013.3413 1015.3829 1027.5038 1055.2609 1055.5406 1058.8355 1081.6195 1083.2573 1104.6995 1114.5046 1117.3026 1128.3419 1170.7364 1174.9176 1178.7083 1184.8965 1187.8761 1205.0649 1212.9729 1239.0163 1241.3458 1243.5282 1256.5991 1267.9713 1287.3251 1292.6485 1317.0980 1322.5270 1353.6361 1355.0177 1361.7497 1370.6348 1372.7802 1384.7654 1427.3975 1440.4487 1453.2558 1457.5498 1465.8246 1483.6748 1484.9399 1493.2522 1495.5951 1500.1058 1513.8044 1523.9357 1535.5638 1544.6674 1546.0880 1563.8202 1589.6461 1622.4867 1627.8724 1646.4757 1654.1120 1655.2375 1660.4375 1663.5381 1673.7809 1697.8290 2201.8591 2997.9084 3003.5300 3092.4843 3107.2816 3131.6612 3172.6951 3178.7120 3180.9496 3186.6486 3188.4762 3197.4856 3198.9788 3201.6986 3205.4242 3208.2820 3208.6055 3212.5324 3213.5719 3215.2432 3216.6008 3234.2725 3237.0664 3245.5708 3277.9572 3624.8312
redmass: 11.7237 5.9043 6.2589 6.4038 3.9297 4.6533 6.0789 4.8587 5.8241 8.9732 5.9647 7.5729 8.7691 6.4836 5.9528 5.9162 6.9942 4.5153 7.3027 5.0896 4.8592 3.7823 9.9724 1.1299 1.4187 3.6424 3.9601 5.5744 5.7133 5.4388 3.2365 7.6696 4.9576 3.4007 3.3764 4.6862 6.1276 3.0212 3.0988 3.9627 6.9817 3.0581 4.0056 6.4711 3.5298 4.5261 2.8412 7.8079 4.1902 6.6676 3.2421 7.0062 1.2392 4.4896 3.9159 5.2554 6.1503 6.5403 8.1635 2.1605 1.9474 6.3479 6.2236 6.6279 3.6314 1.6991 1.7921 1.2007 6.2084 1.5343 5.0075 1.2833 4.0911 1.2479 1.6282 6.3734 4.8870 1.4393 5.1871 1.4319 1.3237 1.2818 1.3431 1.2853 2.3422 1.3604 1.2477 1.2460 1.3471 1.3677 6.1517 5.9596 1.2965 1.3625 2.3290 4.7245 2.1134 1.7813 1.9921 1.5785 2.2227 1.5643 2.0276 1.2433 2.6341 1.2010 1.0875 1.1239 1.1341 1.1678 1.7396 3.8151 2.6081 1.8294 3.8010 2.6020 1.7801 3.4281 3.1403 3.2594 2.4068 1.7927 4.7009 2.7819 2.6596 1.2858 1.2217 3.7560 2.0623 2.1941 2.0712 2.2612 1.0522 3.0207 1.0702 1.0629 1.0975 2.2129 3.2752 2.3367 4.3175 1.9260 5.1575 6.4414 5.7153 4.2536 5.5678 6.5335 5.0313 6.5308 5.6546 11.9980 1.0586 1.0568 1.0810 1.0764 1.0998 1.0996 1.0869 1.0850 1.0880 1.0886 1.0925 1.0874 1.0922 1.0901 1.0909 1.0941 1.0974 1.0974 1.0963 1.0915 1.0965 1.0919 1.0962 1.0917 1.0759
irintensity: 259.7537 0.2531 1.0789 0.1221 0.0913 0.3044 1.6310 2.0670 3.4188 1.7826 1.7345 1.2038 3.2523 2.4191 0.8243 6.3898 6.1845 2.3123 5.3138 1.4692 1.6305 2.9393 9.7970 3.1235 0.1761 2.1931 2.1616 6.8754 0.8966 6.1220 6.0354 19.1723 13.4717 75.0095 12.5541 11.0868 4.1797 0.0041 0.0589 0.0761 21.8296 3.8156 0.0676 5.2219 0.5676 2.0389 21.0442 1.4664 1.1063 7.1312 0.2018 4.0585 108.0808 12.5420 0.2826 18.2641 1.8703 0.0042 22.3427 28.6592 21.1318 11.1899 24.8039 22.2514 34.8653 66.3304 44.7373 6.8131 28.5376 0.1302 10.4387 0.1625 0.6628 0.0010 70.4531 20.3337 12.9660 10.4119 3.8741 4.1848 0.2074 2.0191 0.0044 0.1595 65.7651 0.4392 1.9054 0.1658 0.9652 0.3792 0.2013 0.7441 13.5140 0.4606 10.3022 0.1351 2.9624 21.8128 30.4703 6.6816 0.1150 35.3589 48.2222 31.3906 254.2651 1.2871 0.0523 21.9568 1.5426 2.2178 20.5618 54.3190 20.2131 20.1123 30.9029 302.1244 1.5466 291.1948 0.0636 112.0614 283.5618 0.0060 13.4128 35.7563 17.4999 18.4728 79.9653 8.8010 5.1223 56.3156 163.0016 2.4886 6.3333 19.1571 6.5714 44.3775 114.9228 60.8098 32.3733 182.0709 124.6917 375.3389 3.1324 30.6427 21.6212 129.6905 67.8204 0.5847 26.0926 14.8929 275.3033 119.4581 26.1643 129.8265 13.2960 10.4864 24.4838 7.5379 13.3594 5.2459 4.0976 11.5510 32.5081 0.6819 40.4742 11.0323 6.6084 35.9300 36.7671 16.7986 29.0227 8.6075 27.6331 10.5584 18.8200 4.0571 41.3499
temp: 298.150 k
press: 1.00000 atm
elementType: 29 6 6 6 6 6 1 6 6 6 1 6 6 6 1 1 6 1 1 1 1 7 7 6 6 6 6 6 6 1 6 1 6 1 1 1 35 6 6 6 6 8 7 1 1 1 1 1 1 1 6 6 6 6 1 6 1 6 1 1 1
symmnumber: 1
zpe: 1249193.7 jmol-1
zpe.correction: 0.475793 hartree
zpe.thermalcorrener: 0.509222 hartree
zpe.thermalcorrenthalpy: 0.510166 hartree
zpe.thermalcorrgfe: 0.404181 hartree
zpe.sumelectzpe: -1608.020033 hartree
zpe.sumelectthermal: -1607.986604 hartree
zpe.sumelectthermalent: -1607.985660 hartree
zpe.sumelectthermalfe: -1608.091645 hartree
dipole: -3.9879 -8.9945 -2.6719
dipole: 10.1952
quadrupole: -209.6640 -191.8890 -193.4574
quadrupole: 14.5811 16.0709 28.8668
quadrupole: -11.3272 6.4478 4.8794 14.5811 16.0709 28.8668
hfenergy: -1608.4958261 hartree
pointgroup: C01 [X(C30H25Br1Cu1N3O1)]
dipole: -1.568963 -3.5386956 -1.0512193 debye
polarizability: 495.2620505|6.1634892|600.6797389|202.1251549|-69.4674965|679.6388201 unknown
InChI: InChI=1/C12H8N2.C10H12NO.C8H5.BrH.Cu/c1-3-9-5-6-10-4-2-8-14-12(10)11(9)13-7-1;1-8(2)10(12)11-9-6-4-3-5-7-9;1-2-8-6-4-3-5-7-8;;/h1-8H;3-7,11H,1-2H3;3-7H;1H;/q-2;;;;+3/p-1/rC20H13BrCuN2.C10H12NO/c21-22(13-12-16-6-2-1-3-7-16)23-14-4-8-17-10-11-18-9-5-15-24(22)20(18)19(17)23;1-8(2)10(12)11-9-6-4-3-5-7-9/h1-11,14-15H;3-7,11H,1-2H3
charge 0 multiplicity 1
61 atoms
Cu 0.07148499 0.55001462 -1.55410476
C  -0.47250813 -2.33304352 -1.66293928
C  0.93745573 -1.88637938 0.11638613
C  -1.2266042 -1.83752218 -2.78572842
C  -0.49867182 -3.71806038 -1.37009165
C  0.96943413 -3.24502298 0.48149304
H  1.50113288 -1.15319292 0.68237987
C  -1.98171353 -2.72908662 -3.58644699
C  -1.27464793 -4.59866487 -2.19835124
C  0.25368472 -4.16213308 -0.25877056
H  1.56094643 -3.54071596 1.3408116
C  -2.69277685 -2.16799881 -4.67271491
C  -1.98685042 -4.1267991 -3.26146314
C  -1.8509604 -0.00289319 -4.04581695
H  -1.2819221 -5.65776995 -1.95617271
H  0.25930928 -5.21815437 -0.00194252
C  -2.62761642 -0.8073458 -4.90303723
H  -3.28481285 -2.81352054 -5.31605053
H  -2.56991118 -4.80334449 -3.88015182
H  -1.77336726 1.07237025 -4.1808119
H  -3.16299744 -0.34947442 -5.72822937
N  0.23957662 -1.43591453 -0.92326179
N  -1.17454652 -0.50819664 -3.0245761
C  -0.29036794 2.31567033 -2.13541967
C  -0.57155704 3.43515017 -2.55683956
C  -0.89252214 4.74139689 -3.04260115
C  -2.00030819 5.45301936 -2.53440021
C  -0.10840592 5.35396607 -4.043704
C  -2.30765118 6.72607443 -3.01000067
H  -2.61053495 4.99504019 -1.7612667
C  -0.4221361 6.6272479 -4.51444477
H  0.74926078 4.81875423 -4.44087196
C  -1.52217637 7.32037205 -4.00160621
H  -3.16416788 7.25770548 -2.60261742
H  0.19680525 7.08159658 -5.28432794
H  -1.76410782 8.31414931 -4.36925922
Br 1.88954499 1.42264008 0.07410226
C  3.79831777 1.20996512 1.91138631
C  3.02837585 0.28355577 2.7785848
C  4.89201614 0.57319119 1.10505978
C  3.99268024 2.65785727 2.27945967
O  3.08442533 -0.94569712 2.6313873
N  2.25678751 0.88017369 3.7573783
H  4.61407749 -0.42970358 0.77805619
H  5.1490218 1.1838884 0.23431094
H  5.80359622 0.47863126 1.72016397
H  3.06235258 3.18951078 2.50688021
H  4.65554746 2.75023535 3.15614801
H  4.46840768 3.19860949 1.45576602
H  2.23182931 1.89027846 3.75277944
C  1.387496 0.28703426 4.68957668
C  0.61588366 1.15418053 5.48569538
C  1.26601877 -1.10113244 4.87719216
C  -0.2575526 0.64948857 6.44409609
H  0.7045134 2.2295506 5.34489487
C  0.38454418 -1.59050888 5.84236952
H  1.85862302 -1.7700861 4.27038691
C  -0.3811525 -0.7299049 6.63057214
H  -0.84390571 1.33944566 7.04533717
H  0.30138934 -2.66621072 5.97739832
H  -1.06271714 -1.12543788 7.37836831
