program: Gaussian 09
title: Title Card Required
version: ES64L-G09RevD.01
method: RB3LYP
basis: Gen
operation: Freq
keyword: #P
keyword: Geom=AllCheck
keyword: Guess=TCheck
keyword: SCRF=Check
keyword: GenChk
keyword: RB3LYP/ChkBas
keyword: Freq
converged: YES YES NO YES
title: Mulliken charges:
elementType: Cu C C C C C C C C C C H C C H H H H H H H N N O C O O Cs
charge: 0.089919 -0.160963 -0.170556 0.154295 0.187575 0.019227 -0.197233 0.235552 0.155299 -0.202550 -0.184489 0.157824 -0.156005 0.034858 0.151808 0.157814 0.159661 0.183157 0.151920 0.159544 0.190607 -0.490688 -0.404153 -0.554196 0.717818 -0.640259 -0.642569 0.896783
chargesum: 0.00000
title: Mulliken charges with hydrogens summed into heavy atoms:
elementType: Cu C C C C C C C C C C C C N N O C O O Cs
charge: 0.089919 -0.003149 -0.010896 0.154295 0.187575 0.202384 -0.045425 0.235552 0.155299 -0.050630 -0.026665 0.003539 0.225465 -0.490688 -0.404153 -0.554196 0.717818 -0.640259 -0.642569 0.896783
polarizability: 3.18632021e+02 1.95074351e+01 2.93868513e+02 1.32222363e+02 -8.07696891e+01 2.24127943e+02
1716.lowfreq: -10.9220 -3.4722 -0.0006 -0.0004 0.0005 3.9884 13.3949 20.1061 42.0581
frequency: 9.2700 14.8389 41.7731 50.6604 75.7314 81.5497 92.3211 119.0330 128.2971 150.9974 158.5267 169.1898 233.8194 257.9058 262.8134 286.8976 352.6525 417.7589 431.1850 452.0711 483.6962 514.0290 520.7040 563.5932 565.5091 617.0916 641.3975 672.6049 723.8691 734.1626 735.7645 741.7281 774.0250 806.9890 833.1365 837.5760 855.5288 878.9445 912.6101 932.9540 963.5305 975.6596 982.6450 992.7893 1038.4692 1052.3149 1080.2678 1112.5803 1124.8166 1169.7822 1180.9386 1239.9317 1243.2425 1255.7133 1293.3978 1340.9182 1347.8702 1362.0707 1381.6521 1442.4715 1454.0811 1465.2063 1479.3916 1538.7043 1549.3416 1606.3228 1618.3559 1633.6624 1649.5106 1670.7634 3187.0927 3191.1668 3195.4753 3200.2196 3205.1887 3216.4028 3220.3883 3231.1961
redmass: 10.5380 8.3889 12.1048 12.4383 9.9867 9.6923 11.8889 6.8335 11.4709 14.0435 5.7747 11.6655 3.6054 5.1213 15.5048 5.5500 21.3485 4.0003 7.3177 4.1214 6.8431 3.3974 4.6449 3.2621 6.9346 4.0176 8.2225 15.6449 11.8068 5.9263 3.8543 6.8081 1.2020 1.3416 7.2067 12.6528 1.6480 6.4099 5.3497 1.3869 1.3545 1.3217 1.3278 1.3565 15.6554 5.7896 2.5520 2.2436 2.2800 1.2826 1.2464 1.6475 2.6001 1.8848 1.7612 4.0322 12.9213 4.1900 2.8907 4.6678 2.1611 1.9011 2.5142 3.2192 4.0774 5.5627 5.2722 12.3016 6.0638 6.2363 1.0869 1.0883 1.0916 1.0889 1.0962 1.0916 1.0967 1.0968
irintensity: 7.2674 4.3606 9.8362 3.4258 1.1306 2.7271 0.7005 2.5049 28.5486 3.2215 3.6485 53.4100 3.5896 0.0447 4.7707 16.9813 158.7393 0.0371 8.0768 0.2743 0.4110 0.0861 1.6645 0.1307 0.6494 0.2495 6.9831 6.9062 129.2662 16.4588 29.7693 3.0693 14.5185 0.0102 1.0214 18.9624 73.5770 0.7021 11.6255 1.1379 0.7366 0.1073 0.6561 0.5370 11.1119 6.8816 14.0069 0.5690 2.1349 9.3005 8.3954 52.2271 6.2173 4.0673 14.1284 69.5900 407.6865 14.6330 3.8235 26.0168 31.4199 30.0386 139.8449 6.1511 50.4335 149.1752 142.8905 1299.4758 13.3067 16.7878 1.1684 6.0352 11.0408 0.0495 40.3566 9.0697 28.6857 16.7281
temp: 298.150 k
press: 1.00000 atm
elementType: 29 6 6 6 6 6 6 6 6 6 6 1 6 6 1 1 1 1 1 1 1 7 7 8 6 8 8 55
symmnumber: 1
zpe: 496610.2 jmol-1
zpe.correction: 0.189149 hartree
zpe.thermalcorrener: 0.206970 hartree
zpe.thermalcorrenthalpy: 0.207914 hartree
zpe.thermalcorrgfe: 0.137327 hartree
zpe.sumelectzpe: -1052.897672 hartree
zpe.sumelectthermal: -1052.879851 hartree
zpe.sumelectthermalent: -1052.878907 hartree
zpe.sumelectthermalfe: -1052.949494 hartree
dipole: -7.5877 4.1106 9.2509
dipole: 12.6510
quadrupole: -123.5443 -107.9758 -36.0891
quadrupole: 13.6982 25.5964 10.9186
quadrupole: -34.3412 -18.7728 53.1140 13.6982 25.5964 10.9186
hfenergy: -1053.0868207 hartree
pointgroup: C01 [X(C13H8Cs1Cu1N2O3)]
dipole: -2.9852196 1.6172352 3.639573 debye
polarizability: 318.6320211|19.5074351|293.8685129|132.2223631|-80.7696891|224.1279425 unknown
InChI: InChI=1/C12H8N2.CO3.Cs.Cu/c1-3-9-5-6-10-4-2-8-14-12(10)11(9)13-7-1;2-1(3)4;;/h1-8H;;;/q-1;-2;+1;+2/rC13H8CsCuN2O3/c1-3-9-5-6-10-4-2-8-17(12(10)11(9)16-7-1)15-19-13-14(18-13)20(13)15/h1-8H
charge 0 multiplicity 1
28 atoms
Cu 0.05604771 0.73065511 0.73003337
C  -3.02777561 -2.79212827 0.5823333
C  -3.98915366 -2.22076579 -0.23368537
C  -3.79790305 -0.90986219 -0.71934125
C  -2.6054331 -0.23897188 -0.33260736
C  -1.8831936 -2.0416087 0.91135647
C  -4.73691324 -0.23694446 -1.57062664
C  -2.34635389 1.09529648 -0.80997155
C  -3.29546401 1.73280118 -1.65141846
C  -4.49578492 1.02942019 -2.01314871
C  -3.01098074 3.03832103 -2.10224374
H  -3.71693527 3.55360822 -2.74772408
C  -1.82379978 3.63850596 -1.71227183
C  -0.93723615 2.93897079 -0.88607935
H  -5.64660178 -0.75895635 -1.85610692
H  -3.14343071 -3.80007456 0.96859416
H  -4.88772684 -2.76850532 -0.50685562
H  -1.10538606 -2.45594152 1.54866166
H  -5.21157051 1.5332119 -2.65768557
H  -1.56529177 4.64051846 -2.03987344
H  0.00256617 3.38034794 -0.57235093
N  -1.17258248 1.69589035 -0.43500534
N  -1.67720142 -0.80586921 0.47550625
O  1.84440411 -0.20875752 0.87914898
C  1.91440698 0.10195648 2.1463108
O  0.87947032 0.81755091 2.59270428
O  2.86003094 -0.23371305 2.90535483
Cs 1.78505337 0.99323483 5.39642905
