program: Gaussian 09
title: Title Card Required
version: ES64L-G09RevD.01
method: RB3LYP
basis: Gen
operation: Freq
keyword: #P
keyword: Geom=AllCheck
keyword: Guess=TCheck
keyword: SCRF=Check
keyword: GenChk
keyword: RB3LYP/ChkBas
keyword: Freq
converged: YES YES NO YES
title: Mulliken charges:
elementType: Cu C C C C C C C C C C H C C H H H H H H H N N O C O O Cs C C H C C C C H C H C H H H
charge: 0.089357 -0.154756 -0.161449 0.157523 0.193731 0.021865 -0.192582 0.241032 0.152798 -0.206766 -0.180722 0.159863 -0.154179 0.038413 0.153203 0.156802 0.161919 0.185068 0.150553 0.161675 0.194191 -0.484776 -0.396509 -0.544828 0.706204 -0.636422 -0.633148 0.877436 0.117956 -0.494705 0.308656 0.002986 -0.150496 -0.145175 -0.147542 0.151454 -0.149916 0.156508 -0.137262 0.144790 0.143688 0.143562
chargesum: 0.00000
title: Mulliken charges with hydrogens summed into heavy atoms:
elementType: Cu C C C C C C C C C C C C N N O C O O Cs C C C C C C C C
charge: 0.089357 0.002046 0.000469 0.157523 0.193731 0.206933 -0.039379 0.241032 0.152798 -0.056213 -0.020858 0.007496 0.232604 -0.484776 -0.396509 -0.544828 0.706204 -0.636422 -0.633148 0.877436 0.117956 -0.186049 0.002986 0.000958 0.011333 -0.002752 -0.006228 0.006300
polarizability: 4.43581427e+02 3.22830285e+01 3.53982007e+02 7.79168076e+01 -1.01346877e+02 2.50516389e+02
1716.lowfreq: 0.0004 0.0007 0.0008 2.8216 6.3252 9.3266 13.8532 20.0520 21.6239
frequency: 11.7156 19.8559 21.0366 24.4933 45.0185 45.8602 52.3742 53.1223 61.9858 87.1922 96.5383 106.7399 117.0847 127.2111 139.0834 152.1132 172.3151 178.6077 197.2728 210.5603 220.5438 237.4082 259.4696 285.2626 358.9666 383.7013 414.2041 416.6683 430.5096 453.4741 481.8059 482.8542 512.8141 520.9462 529.5247 558.4643 562.8615 565.9997 616.1140 635.7979 644.4881 670.1641 705.1485 723.4458 733.4150 740.2369 742.9584 773.8761 774.8488 780.1626 808.5941 839.4496 841.9977 855.7929 856.1449 877.5813 897.6986 906.8682 913.8777 928.7299 939.5157 967.4165 970.0868 977.1022 985.4442 995.0593 998.3067 1014.8076 1033.2007 1053.2547 1057.1195 1078.3790 1112.2870 1112.7807 1126.1502 1170.7645 1181.8213 1198.3025 1215.2131 1231.7033 1238.8597 1241.4800 1257.3091 1295.8363 1329.0887 1332.4307 1342.4514 1362.0725 1365.6668 1383.8988 1441.5885 1455.8719 1464.8967 1482.1749 1487.8507 1538.7601 1541.2747 1550.7231 1611.2536 1625.9228 1626.5975 1640.9066 1654.5741 1657.9781 1670.8071 2171.0221 3080.6625 3186.0040 3188.8923 3192.6420 3194.5334 3198.8116 3199.8475 3205.9674 3207.6338 3214.4109 3218.8042 3220.1976 3222.0911 3234.2009
redmass: 6.9906 6.4318 5.8884 7.4177 9.3056 5.7230 5.7238 9.8034 12.8286 8.0948 11.4017 5.9146 11.1434 6.7857 12.8840 6.8630 7.9689 7.9503 6.8821 6.4158 15.3086 3.6551 5.1258 5.5982 18.8157 4.8990 2.9781 4.0553 7.0626 4.0971 7.0803 6.7019 3.4237 4.6887 7.5561 3.7824 3.1577 7.3742 4.0021 6.5815 8.1401 15.4021 2.0052 12.6218 6.4586 4.4659 4.9014 1.6407 1.3000 4.9814 1.3332 7.8252 5.8658 1.4591 1.4004 6.3586 1.1003 1.2295 5.2116 1.3978 1.3881 1.3212 1.3517 1.3380 1.3316 1.3717 1.2586 6.1801 15.4917 5.6365 2.2585 2.5497 1.5995 2.2727 2.2298 1.2646 1.2433 1.1006 1.1577 3.5278 2.5451 1.7307 1.8460 1.7979 3.2950 12.3441 4.0052 4.0933 1.7092 2.8328 4.5688 2.0364 1.9971 2.5420 2.2144 2.1705 3.2350 4.0589 5.8987 5.3116 5.1095 12.6143 6.1957 5.4245 6.2664 4.5521 1.2505 1.0856 1.0871 1.0891 1.0889 1.0911 1.0892 1.0928 1.0962 1.0954 1.0918 1.0963 1.0969 1.0965
irintensity: 1.7019 1.6153 2.8801 2.3436 5.4356 2.0327 0.3021 3.9854 8.9889 0.9726 2.1143 5.3947 8.9582 2.1737 17.7092 33.7714 16.7213 21.1630 4.3530 10.5312 51.0722 2.8935 0.3605 18.8009 81.0433 1.8687 0.0586 0.7797 5.8515 2.6088 13.5725 0.1273 0.1416 1.3136 1.7132 6.7205 0.8220 0.6896 2.4500 0.0421 8.7650 11.1842 28.5954 67.7524 4.8351 22.6769 20.7779 17.8577 37.1552 1.2944 0.3755 1.7579 9.8886 43.6356 30.0055 1.5817 68.8624 33.0065 9.6623 14.3491 2.9521 0.6945 0.2178 0.8071 0.5491 0.6424 0.3196 0.2154 48.6731 3.7855 3.1333 10.3918 6.6063 0.7434 1.3216 8.3281 1.2473 0.0232 0.3548 1.9843 17.4431 18.2830 1.6436 11.3335 1.7437 668.8851 22.8612 9.3933 0.4851 2.6169 5.1356 20.3494 42.8696 60.2852 4.4947 16.8567 8.0604 18.3617 118.8416 23.6036 2.5765 1242.5806 12.6332 5.1550 12.2931 102.1404 957.5758 0.6162 2.5288 6.5606 9.0881 8.4948 0.9644 26.6769 33.9178 23.2351 9.9892 3.9519 25.6860 13.4744
temp: 298.150 k
press: 1.00000 atm
elementType: 29 6 6 6 6 6 6 6 6 6 6 1 6 6 1 1 1 1 1 1 1 7 7 8 6 8 8 55 6 6 1 6 6 6 6 1 6 1 6 1 1 1
symmnumber: 1
zpe: 788445.3 jmol-1
zpe.correction: 0.300303 hartree
zpe.thermalcorrener: 0.326201 hartree
zpe.thermalcorrenthalpy: 0.327146 hartree
zpe.thermalcorrgfe: 0.237668 hartree
zpe.sumelectzpe: -1361.211575 hartree
zpe.sumelectthermal: -1361.185677 hartree
zpe.sumelectthermalent: -1361.184733 hartree
zpe.sumelectthermalfe: -1361.274211 hartree
dipole: -10.5513 5.0268 7.5547
dipole: 13.9166
quadrupole: -162.0070 -147.6871 -94.2616
quadrupole: 10.3887 3.5369 12.9812
quadrupole: -27.3551 -13.0352 40.3903 10.3887 3.5369 12.9812
hfenergy: -1361.5118785 hartree
pointgroup: C01 [X(C21H14Cs1Cu1N2O3)]
dipole: -4.1512074 1.9776833 2.9722586 debye
polarizability: 443.5814273|32.2830285|353.9820073|77.9168076|-101.3468771|250.5163887 unknown
InChI: InChI=1/C12H8N2.C8H6.CO3.Cs.Cu/c1-3-9-5-6-10-4-2-8-14-12(10)11(9)13-7-1;1-2-8-6-4-3-5-7-8;2-1(3)4;;/h1-8H;1,3-7H;;;/q-1;;-2;+1;+2/rC13H8CsCuN2O3.C8H6/c1-3-9-5-6-10-4-2-8-17(12(10)11(9)16-7-1)15-19-13-14(18-13)20(13)15;1-2-8-6-4-3-5-7-8/h1-8H;1,3-7H
charge 0 multiplicity 1
42 atoms
Cu 0.30521858 0.63432494 0.35320392
C  -2.85937266 -2.8628021 0.44693765
C  -3.9304481 -2.18663654 -0.10584254
C  -3.74343131 -0.88061303 -0.60893328
C  -2.44297621 -0.32032705 -0.499253
C  -1.60591677 -2.22098365 0.49836719
C  -4.80018162 -0.10524684 -1.19081456
C  -2.20470919 1.02902355 -0.95767044
C  -3.27050865 1.76408298 -1.53948473
C  -4.57049062 1.16029825 -1.64171577
C  -3.00635785 3.07847772 -1.98146203
H  -3.80210741 3.66505004 -2.43256521
C  -1.73216263 3.59659501 -1.83026126
C  -0.73640186 2.80744822 -1.23985018
H  -5.79142652 -0.54561092 -1.25561238
H  -2.97204639 -3.86521953 0.84780059
H  -4.91798795 -2.63855791 -0.14707288
H  -0.74031851 -2.71603338 0.9324594
H  -5.37432619 1.74454087 -2.08215232
H  -1.48787423 4.60103971 -2.16091159
H  0.27217196 3.1841104 -1.11023231
N  -0.95032869 1.55750147 -0.80429102
N  -1.4051352 -0.99181909 0.04956157
O  1.90972255 -0.22610248 1.13707188
C  1.62372317 0.15580458 2.35474135
O  0.54253474 0.93979128 2.44818214
O  2.2895454 -0.16895528 3.36876434
Cs 0.66685375 1.25901034 5.44047202
C  -3.4055531 -0.15207511 2.94713764
C  -2.21876187 0.10400071 2.9317292
H  -1.1526073 0.31810164 2.80807616
C  -4.79960075 -0.46150799 2.89322056
C  -5.29153805 -1.67081917 3.42221921
C  -5.69720812 0.42044564 2.25895384
C  -6.64462331 -1.98729572 3.31631995
H  -4.6009105 -2.35815073 3.90169234
C  -7.04869867 0.09635587 2.15750537
H  -5.31884025 1.34620857 1.83698558
C  -7.52761249 -1.10699485 2.68380051
H  -7.01095539 -2.9252535 3.72537733
H  -7.72968487 0.78370435 1.66243589
H  -8.58181492 -1.35764225 2.60124188
