program: Gaussian 09
title: Title Card Required
version: ES64L-G09RevD.01
method: RB3LYP
basis: Gen
operation: Freq
keyword: #P
keyword: Geom=AllCheck
keyword: Guess=TCheck
keyword: SCRF=Check
keyword: GenChk
keyword: RB3LYP/ChkBas
keyword: Freq
converged: YES YES YES YES
title: Mulliken charges:
elementType: C C C C C C C C C C H C C H H H H H H H N N Cu Br
charge: -0.155710 -0.157922 0.152017 0.215913 0.032069 -0.191170 0.244478 0.150646 -0.194951 -0.157318 0.176637 -0.155245 0.043415 0.164250 0.174442 0.174071 0.202033 0.164164 0.177199 0.207879 -0.473293 -0.431506 0.115695 -0.477792
chargesum: 0.00000
title: Mulliken charges with hydrogens summed into heavy atoms:
elementType: C C C C C C C C C C C C N N Cu Br
charge: 0.018732 0.016149 0.152017 0.215913 0.234102 -0.026921 0.244478 0.150646 -0.030787 0.019319 0.021954 0.251293 -0.473293 -0.431506 0.115695 -0.477792
polarizability: 2.88316853e+02 1.50761273e+01 2.87897236e+02 2.35361929e+01 -1.21531525e+01 8.73187387e+01
1716.lowfreq: -7.7100 -0.0006 -0.0005 0.0002 6.6046 20.1773 27.8262 29.7732 88.1116
frequency: 27.1708 28.6956 88.0650 90.2185 123.9771 134.4117 152.7253 234.9807 253.7665 269.9642 285.0864 417.4820 428.5512 451.5999 484.0437 511.4771 520.0531 563.9364 567.2374 616.9729 647.2964 735.5329 739.4586 744.6178 785.7568 821.5874 847.5631 865.3826 878.7110 913.6234 969.9622 975.8067 987.7923 1005.0128 1009.2760 1054.4881 1079.5717 1112.5151 1129.3727 1174.9914 1185.4164 1240.5387 1246.8065 1258.2479 1297.5165 1349.2807 1368.7765 1386.7092 1450.2534 1457.7134 1467.8115 1491.7599 1542.9050 1558.1032 1622.7403 1642.9233 1658.3130 1672.5535 3196.8842 3203.4559 3205.1317 3208.4768 3214.0089 3224.5867 3228.8216 3238.2210
redmass: 11.7317 12.7418 7.3558 8.9147 5.1867 14.8526 6.5535 3.5918 5.0885 38.6795 5.4993 3.9034 7.1436 3.9410 6.7866 3.4023 4.6489 3.0913 7.4366 3.8454 8.1872 6.4530 6.4592 3.5694 1.1954 1.3389 7.3839 1.6386 6.4744 5.2919 1.3723 1.3731 1.3311 1.3467 1.3594 5.3243 2.5348 2.3315 2.1560 1.2514 1.2341 3.3806 1.4736 1.8144 1.8107 3.7048 5.9013 2.2885 4.2111 1.9356 2.1308 2.8617 3.2599 4.1478 6.3111 5.5646 6.4301 6.3419 1.0874 1.0891 1.0904 1.0924 1.0964 1.0913 1.0973 1.0974
irintensity: 1.5513 2.0754 1.1178 2.0660 1.6945 3.1966 3.6358 3.1072 0.0006 35.9441 2.1604 0.0125 5.2085 0.0174 1.0993 0.0906 1.3484 0.0163 0.2766 0.0149 9.4911 8.9643 5.4633 39.5477 10.3856 0.0040 0.1491 75.7870 7.9225 0.9043 0.3352 0.4918 0.0735 1.2070 0.3519 0.2298 0.8471 0.9176 10.1390 11.8462 1.9779 0.0200 0.5391 4.3102 0.1443 1.1273 4.4088 1.4653 4.5660 8.7071 69.8001 2.0500 14.4136 47.5031 18.3508 9.3984 1.4050 11.9303 0.2877 3.8060 4.3944 3.4036 22.6068 1.4203 15.1902 9.8107
temp: 298.150 k
press: 1.00000 atm
elementType: 6 6 6 6 6 6 6 6 6 6 1 6 6 1 1 1 1 1 1 1 7 7 29 35
symmnumber: 1
zpe: 456654.6 jmol-1
zpe.correction: 0.173931 hartree
zpe.thermalcorrener: 0.187206 hartree
zpe.thermalcorrenthalpy: 0.188150 hartree
zpe.thermalcorrgfe: 0.130760 hartree
zpe.sumelectzpe: -782.325535 hartree
zpe.sumelectthermal: -782.312259 hartree
zpe.sumelectthermalent: -782.311315 hartree
zpe.sumelectthermalfe: -782.368706 hartree
dipole: 13.1397 -6.5174 1.8481
dipole: 14.7832
quadrupole: -195.0565 -61.8167 -112.9571
quadrupole: 17.6925 -10.0049 -1.2772
quadrupole: -71.7797 61.4601 10.3196 17.6925 -10.0049 -1.2772
hfenergy: -782.4994654 hartree
pointgroup: C01 [X(C12H8Br1Cu1N2)]
dipole: 5.1695588 -2.5641285 0.727079 debye
dipolederiv: -0.2826222 0.0193596 -0.0272242 0.2838724 0.0637539 0.0259372 -0.0476452 -0.0065128 -0.0998401 0.1505281 -0.0352323 0.0353377 0.014081 0.3250353 -0.0291045 0.0302263 -0.0342464 -0.082565 0.1397678 0.2152158 -0.0090897 -0.0184484 -0.4055919 0.0320884 0.0043482 0.0651519 0.0804199 0.1494346 -0.0524554 0.0114239 0.2598136 0.2279462 0.0210347 -0.0090612 -0.0151681 0.0861162 0.3503783 0.0723132 0.0372722 -0.2758786 0.1774301 -0.0469229 0.059565 0.000507 0.0483736 0.0719946 -0.0347309 0.0301363 -0.1664945 0.034854 -0.0356225 0.040171 -0.018355 -0.1317867 0.0790022 0.3326988 -0.0215964 -0.0209384 0.2831072 -0.0153908 0.0013949 0.0292019 0.0878498 -0.3613185 -0.3809629 -0.0294681 -0.0668484 0.1043131 -0.0100189 -0.0511806 -0.0519856 0.0845737 0.1227841 -0.1384737 0.0435051 -0.0190311 -0.0685729 -0.0082129 0.0325109 -0.0222146 -0.1363865 0.2609463 0.096477 0.037373 0.0418576 0.2153098 -0.0157717 0.0347111 -0.0098952 -0.0765306 -0.0638807 -0.0211028 -0.0220217 0.0309352 0.0938237 0.0059226 -0.0222446 0.0004551 0.120083 -0.1240729 0.358472 -0.0289592 0.1107438 -0.091276 0.0137995 -0.0123456 0.0465149 -0.098076 0.2721271 -0.3047774 0.0504139 0.0150152 0.1539723 -0.0051323 0.0291325 -0.0445574 0.0472868 0.0331154 0.0331507 -0.0150833 0.0878918 -0.0558924 0.025489 -0.0189398 0.0185767 0.1302042 0.0387639 -0.0795554 -0.0067361 -0.0760677 -0.0261393 0.0016294 -0.0073464 0.0008971 0.1349836 0.0522747 0.0935446 -0.0159395 0.0439761 -0.0311061 0.0170466 -0.0119302 0.0223946 0.1204428 -0.0390796 -0.0428326 -0.0168525 0.0220224 0.0994726 0.0043287 -0.018077 -0.004234 0.1089197 -0.0839485 0.0215732 -0.0291679 -0.0313191 0.0626251 0.0011043 -0.0219675 0.008596 0.1311885 0.0578652 -0.0629923 -0.0052352 -0.0685437 -0.0360587 0.0037453 -0.0053527 0.0036362 0.1364648 0.0684324 0.0673122 -0.0113521 0.0204426 0.0106393 0.0094544 -0.0069043 0.0144156 0.11525 -0.3031392 -0.0738834 -0.010276 0.0524881 -0.4763281 0.0232068 -0.0155628 0.0077192 -0.193704 -0.4987958 0.0416523 -0.040801 -0.0208224 -0.6244817 0.0227953 -0.0297077 0.0206077 -0.1835834 0.9584499 -0.3412463 0.103954 -0.3898199 0.5927841 -0.0638834 0.1034332 -0.0572035 0.1374686 -1.0490071 0.2164761 -0.0596132 0.1710725 -0.6296197 0.0224777 -0.0572272 0.0256986 -0.5671526 unknown
polarizability: 288.316853|15.0761273|287.8972359|23.5361929|-12.1531525|87.3187387 unknown
InChI: InChI=1/C12H8N2.BrH.Cu/c1-3-9-5-6-10-4-2-8-14-12(10)11(9)13-7-1;;/h1-8H;1H;/q-2;;+3/p-1/rC12H8BrCuN2/c13-14-15-7-1-3-9-5-6-10-4-2-8-16(14)12(10)11(9)15/h1-8H
charge 0 multiplicity 1
24 atoms
C  -3.84091799 -5.35193027 -0.11681534
C  -2.47444451 -5.43515911 0.06744586
C  -1.69919472 -4.25269807 0.07952645
C  -2.38723031 -3.02734412 -0.10202179
C  -4.43085861 -4.0835449 -0.29014715
C  -0.27503155 -4.24163046 0.26046206
C  -1.64787029 -1.78553714 -0.09531589
C  -0.24280031 -1.81012816 0.08399642
C  0.42275024 -3.07028315 0.26196565
C  0.43580897 -0.57059448 0.08285438
H  1.5137269 -0.55030754 0.21868705
C  -0.28095423 0.59748686 -0.08881024
C  -1.67552539 0.52551838 -0.25716757
H  0.23747108 -5.18999135 0.39682275
H  -4.46274506 -6.24102322 -0.1313644
H  -1.98576312 -6.39636754 0.20276458
H  -5.50194053 -3.97627065 -0.43816531
H  1.50048458 -3.06877255 0.39945458
H  0.20840393 1.56557934 -0.09384238
H  -2.27268427 1.42127119 -0.39209258
N  -2.3421153 -0.62705542 -0.26101672
N  -3.72769427 -2.95926995 -0.28298269
Cu -4.34782897 -0.84113155 -0.47039238
Br -6.53628318 -0.09314736 -0.71766587
