program: Gaussian 09
title: Title Card Required
version: ES64L-G09RevD.01
method: RB3LYP
basis: Gen
operation: Freq
keyword: #P
keyword: Geom=AllCheck
keyword: Guess=TCheck
keyword: SCRF=Check
keyword: GenChk
keyword: RB3LYP/ChkBas
keyword: Freq
converged: YES YES NO YES
title: Mulliken charges:
elementType: C C C C C C C C C C H C C H H H H H H H N N Cu C C C C C C H C H C H H H
charge: -0.155793 -0.158583 0.151784 0.210802 0.028493 -0.192085 0.239625 0.153399 -0.195822 -0.159935 0.174933 -0.154622 0.042655 0.162576 0.172355 0.172230 0.200344 0.162633 0.175560 0.208189 -0.475875 -0.424450 -0.058209 0.011035 -0.245704 0.032137 -0.160610 -0.160349 -0.147217 0.142662 -0.147365 0.142614 -0.144211 0.132913 0.132889 0.130999
chargesum: 0.00000
title: Mulliken charges with hydrogens summed into heavy atoms:
elementType: C C C C C C C C C C C C N N Cu C C C C C C C C
charge: 0.016563 0.013647 0.151784 0.210802 0.228838 -0.029509 0.239625 0.153399 -0.033188 0.014997 0.020939 0.250844 -0.475875 -0.424450 -0.058209 0.011035 -0.245704 0.032137 -0.017948 -0.017735 -0.014304 -0.014476 -0.013212
polarizability: 4.60481916e+02 -6.19947384e+01 3.42235344e+02 3.60046870e+01 -2.08268004e+01 1.66541246e+02
1716.lowfreq: -9.0085 -7.6693 -0.0002 0.0004 0.0005 11.7627 16.7913 24.3845 43.6869
frequency: 9.2935 21.7368 42.1053 54.6443 67.8227 83.8791 93.1747 123.8620 128.0744 153.9343 223.4228 237.7230 250.0163 261.2198 272.1142 284.8558 387.7077 416.8921 417.4706 427.3288 453.5546 485.7103 512.8848 519.5297 523.8705 554.4677 564.4303 565.0968 567.4713 617.9339 634.9963 647.4205 709.2941 735.0286 739.1164 746.3849 777.2599 784.8189 810.5488 820.5157 848.4333 854.5406 865.1364 877.5063 912.1607 919.6417 965.7974 971.7472 974.2665 986.8415 991.2307 1003.9048 1007.4095 1011.3078 1054.4035 1055.8334 1077.5452 1107.3944 1111.9072 1128.9270 1173.4200 1181.7344 1192.5882 1211.5262 1240.4875 1244.3572 1246.8727 1255.9087 1296.6984 1321.2833 1348.4724 1362.4649 1368.4987 1387.4243 1451.4093 1456.1253 1467.2164 1484.5727 1493.0305 1535.7492 1542.1500 1558.4926 1620.1488 1623.3723 1642.9593 1654.0616 1658.3010 1671.4145 2179.7271 3176.5261 3183.8971 3193.7411 3198.9197 3201.9892 3204.5472 3205.0877 3208.0249 3210.6018 3210.9519 3225.2234 3228.0440 3238.5151
redmass: 7.7424 6.8442 3.8175 5.9076 10.1583 6.1838 5.7401 5.3677 7.6925 5.9213 6.9674 3.5821 6.1530 7.1715 15.3939 5.4785 6.1108 3.2682 3.5542 7.1049 3.9455 6.7139 3.4025 4.6622 7.7348 3.4562 3.0827 7.9333 8.2022 3.8338 6.5670 8.1795 1.8432 6.3819 6.5310 3.5336 1.8696 1.1951 6.2900 1.3343 7.6233 1.2505 1.6555 6.4275 5.2251 1.4615 1.3442 1.3477 1.3945 1.3346 1.2483 1.3485 1.3614 6.1700 5.0664 2.2118 2.5340 1.6008 2.3666 2.1233 1.2460 1.2247 1.0929 1.1379 3.2379 3.4163 1.6230 1.7820 1.8083 3.2334 3.7731 1.7353 5.9798 2.2848 3.9407 1.9388 2.2259 2.2505 2.9693 2.1923 3.2916 4.1775 5.0490 6.3278 5.5941 5.4645 6.5426 6.4410 11.9983 1.0851 1.0885 1.0873 1.0919 1.0891 1.0903 1.0941 1.0921 1.0964 1.0976 1.0913 1.0972 1.0972
irintensity: 0.6875 1.8856 0.0433 4.4262 5.3063 3.9018 0.8786 1.2632 0.2733 0.8955 9.4447 2.9271 5.4223 8.3008 4.1592 10.5004 1.1758 0.0096 0.0295 5.1566 0.0273 0.9385 0.0164 1.3437 2.0257 4.9277 0.0031 0.0021 1.1218 0.0182 0.0029 10.5350 24.9855 10.1289 4.8208 40.5382 43.1006 10.3246 8.8697 0.0050 0.1159 0.0273 72.4110 8.7853 1.1418 5.6544 0.0228 0.0349 0.9257 0.0368 0.2475 1.3919 0.0928 1.4397 0.2742 7.9934 1.0952 7.5970 1.1862 14.2478 11.7397 2.4817 0.1911 4.2165 0.5942 49.7474 4.7834 3.8934 0.5200 0.0600 1.9441 0.0595 4.6310 3.4423 3.9258 4.6544 70.6756 1.7380 1.9553 65.2931 14.0685 51.5688 3.9483 20.2867 11.2166 85.6797 1.3750 10.7801 139.6215 7.6768 11.6108 0.5531 35.4627 4.9564 3.6183 42.6224 3.0076 29.0923 16.4433 2.1376 15.6559 9.8326
temp: 298.150 k
press: 1.00000 atm
elementType: 6 6 6 6 6 6 6 6 6 6 1 6 6 1 1 1 1 1 1 1 7 7 29 6 6 6 6 6 6 1 6 1 6 1 1 1
symmnumber: 1
zpe: 717819.7 jmol-1
zpe.correction: 0.273403 hartree
zpe.thermalcorrener: 0.292178 hartree
zpe.thermalcorrenthalpy: 0.293123 hartree
zpe.thermalcorrgfe: 0.222473 hartree
zpe.sumelectzpe: -1076.599034 hartree
zpe.sumelectthermal: -1076.580259 hartree
zpe.sumelectthermalent: -1076.579314 hartree
zpe.sumelectthermalfe: -1076.649964 hartree
dipole: 11.4169 -6.9613 1.6855
dipole: 13.4777
quadrupole: -204.6902 -97.1780 -138.5090
quadrupole: 20.8819 -8.4297 -0.7733
quadrupole: -57.8978 49.6144 8.2834 20.8819 -8.4297 -0.7733
hfenergy: -1076.872437 hartree
pointgroup: C01 [X(C20H13Cu1N2)]
dipole: 4.4917733 -2.7388036 0.6631296 debye
polarizability: 460.4819162|-61.9947384|342.2353441|36.004687|-20.8268004|166.5412458 unknown
InChI: InChI=1/C12H8N2.C8H5.Cu/c1-3-9-5-6-10-4-2-8-14-12(10)11(9)13-7-1;1-2-8-6-4-3-5-7-8;/h1-8H;3-7H;/q-1;;+1/rC20H13CuN2/c1-2-6-16(7-3-1)12-13-21-23-15-5-9-18-11-10-17-8-4-14-22-19(17)20(18)23/h1-11,14-15H
charge 0 multiplicity 1
36 atoms
C  -4.00365357 -5.17761845 -0.13560574
C  -2.64571135 -5.33909972 0.0608592
C  -1.80504648 -4.20233577 0.0784644
C  -2.42291261 -2.9415044 -0.11157318
C  -4.51909469 -3.87745633 -0.31510558
C  -0.3836251 -4.26720874 0.27164764
C  -1.61849661 -1.74263367 -0.10232231
C  -0.21822095 -1.84078488 0.08787176
C  0.37661498 -3.13485291 0.2755588
C  0.52297156 -0.63771441 0.08662372
H  1.59962656 -0.67086346 0.23071793
C  -0.13261013 0.56430838 -0.09696499
C  -1.5280721 0.56290236 -0.27439111
H  0.07626077 -5.24126076 0.41504809
H  -4.67566329 -6.02940391 -0.15440448
H  -2.21431525 -6.32663744 0.20159236
H  -5.58129814 -3.71038502 -0.47160617
H  1.45161898 -3.19151778 0.42277156
H  0.40554566 1.50617678 -0.10352288
H  -2.07835116 1.48707984 -0.41710233
N  -2.25371553 -0.55333091 -0.27694153
N  -3.7545611 -2.79451736 -0.30346271
Cu -4.28674038 -0.59520021 -0.48430966
C  -5.95188172 0.19000332 -0.67214184
C  -7.06381433 0.70644087 -0.7994072
C  -8.34870871 1.31052134 -0.94273264
C  -8.8867151 1.58039699 -2.22055442
C  -9.11995465 1.65669507 0.18898395
C  -10.14047278 2.17283831 -2.35689547
H  -8.30485418 1.32016757 -3.10021379
C  -10.3732936 2.24825531 0.04477787
H  -8.72014628 1.45411932 1.17857282
C  -10.89170003 2.51030825 -1.22698299
H  -10.53347112 2.37260981 -3.35100909
H  -10.9493552 2.50569658 0.93047388
H  -11.8692993 2.97267546 -1.33612948
