program: Gaussian 09
title: Title Card Required
version: ES64L-G09RevD.01
method: RB3LYP
basis: Gen
operation: Freq
keyword: #P
keyword: Geom=AllCheck
keyword: Guess=TCheck
keyword: SCRF=Check
keyword: GenChk
keyword: RB3LYP/ChkBas
keyword: Freq
converged: YES YES NO YES
title: Mulliken charges:
elementType: Br C C C C O N H H H H H H H C C C C H C H C H H H C C C C C C C C C C H C C H H H H H H H N N Cu C C C C C C H C H C H H H
charge: -0.797127 0.145894 0.585601 -0.508057 -0.514960 -0.464300 -0.657456 0.203287 0.226214 0.185768 0.243633 0.181336 0.209613 0.362210 0.352994 -0.213342 -0.173385 -0.141101 0.156267 -0.151253 0.181647 -0.144388 0.139297 0.138802 0.132207 -0.153345 -0.159384 0.164266 0.237453 0.034795 -0.189836 0.230684 0.159451 -0.192975 -0.164197 0.179027 -0.150291 0.020168 0.164580 0.174665 0.175085 0.201869 0.165059 0.179988 0.197169 -0.461942 -0.457451 0.016656 -0.010599 -0.108663 -0.001228 -0.144662 -0.150262 -0.144738 0.175353 -0.142650 0.155785 -0.129321 0.151766 0.148813 0.149512
chargesum: 0.00000
title: Mulliken charges with hydrogens summed into heavy atoms:
elementType: Br C C C C O N C C C C C C C C C C C C C C C C C C N N Cu C C C C C C C C
charge: -0.797127 0.145894 0.585601 0.107212 0.119622 -0.464300 -0.295245 0.352994 -0.057076 0.008262 -0.001804 -0.012451 -0.012182 0.021320 0.015701 0.164266 0.237453 0.236664 -0.025256 0.230684 0.159451 -0.027916 0.014830 0.029697 0.217337 -0.461942 -0.457451 0.016656 -0.010599 -0.108663 -0.001228 0.030691 0.005523 0.007028 0.006163 0.020191
polarizability: 4.40670267e+02 4.04843777e+01 5.33110895e+02 1.68965253e+02 -4.69757591e+00 5.96831225e+02
1716.lowfreq: -172.0019 -6.6932 -1.3177 -0.0004 -0.0003 0.0006 2.6673 10.1186 17.0838
frequency: -171.9970 8.0676 16.7458 21.4413 24.6844 33.2562 39.1299 53.9828 63.1112 66.1767 69.7571 75.8193 80.2741 95.7879 102.8911 107.6086 114.4013 128.6863 136.7508 139.9732 145.5400 158.9542 186.8666 209.9371 233.0426 235.6721 239.4441 252.2745 262.5355 268.1208 280.3116 287.9669 303.7256 341.5152 358.2920 379.0008 387.4265 414.1362 415.7482 422.7914 429.5180 437.3930 450.2582 485.9699 512.5695 519.7866 521.9969 522.4353 550.5682 553.8454 559.3852 562.7603 569.0526 604.1991 617.2890 627.5722 630.5193 633.3080 648.5641 690.1999 703.2665 704.3352 738.6546 738.7532 744.5996 770.9814 779.6608 784.5238 810.2611 817.9491 839.0884 846.0189 849.7148 858.1998 863.8697 880.8589 890.8117 911.2784 914.6819 926.0429 938.2527 968.7951 971.2615 973.2381 977.6843 984.6937 985.6352 988.2175 1003.2480 1004.9240 1006.7468 1009.0456 1013.2238 1013.6133 1054.2146 1055.6472 1057.7175 1060.2711 1082.6274 1111.5934 1114.1454 1121.8064 1131.7807 1176.4543 1182.3436 1185.9405 1194.3821 1198.2896 1212.1140 1219.4152 1242.6647 1244.6855 1249.7031 1258.9934 1276.1510 1285.5225 1296.7541 1311.9922 1328.7193 1349.9630 1355.3109 1365.7593 1369.4940 1372.2252 1386.1265 1406.2161 1414.3868 1454.8836 1459.2324 1469.0456 1473.6445 1483.3086 1485.0929 1488.4332 1495.1671 1502.7536 1521.8994 1532.8957 1543.7251 1546.0048 1561.3729 1582.1486 1619.2616 1626.2406 1642.7725 1650.9260 1653.6995 1657.9907 1660.7816 1673.6259 1740.9894 2125.2730 3052.2472 3070.1126 3118.8491 3127.3356 3182.0576 3185.4594 3188.5972 3189.0790 3190.3787 3197.9722 3198.5732 3200.5494 3204.1179 3206.0869 3208.2139 3212.6793 3214.6669 3215.6325 3215.7941 3220.2117 3223.2126 3232.1250 3236.7872 3269.6518 3569.2548
redmass: 5.5265 5.5655 7.4819 7.1991 4.8967 5.2370 8.1038 6.9361 8.3229 6.2597 8.0353 7.1603 4.1966 5.8472 6.1952 8.1770 4.7919 7.3204 6.4483 5.4678 5.5936 4.9943 1.6934 1.9090 1.6258 3.5477 3.5472 5.0796 6.1998 4.3762 3.4143 5.2452 4.2119 3.6174 3.1099 5.5682 4.0701 3.9122 2.9444 3.1168 7.1069 3.1497 3.9928 6.8408 3.3720 6.5395 4.5548 3.2044 4.3811 4.9096 3.1693 6.2433 7.4958 1.6663 3.8395 2.9661 5.4205 6.5408 8.1587 7.4615 1.8546 2.1987 6.1595 6.6051 3.6474 1.6509 1.8350 1.1955 6.2598 1.3393 5.1292 6.3974 1.2733 1.2516 1.6388 6.4799 4.2388 1.4662 5.2213 1.2765 1.4031 1.3211 1.3525 1.3941 1.3641 1.9015 1.3277 1.2648 1.3523 1.2823 1.3675 1.5442 5.8270 5.2918 1.9189 1.9569 4.4082 2.0838 2.5157 1.5982 2.3292 1.5680 2.1560 1.2555 2.8061 1.2390 1.1084 1.0989 1.1667 1.1417 3.3780 3.8905 1.4594 1.8083 3.0699 2.5684 1.7962 3.0681 2.9840 3.7762 2.1941 1.8251 6.2241 2.4062 2.2153 1.2664 1.1794 3.8179 2.1386 2.0064 1.0502 2.1096 2.2210 1.1002 2.9450 1.0801 1.1212 2.1296 3.2315 2.2929 4.2353 1.8636 4.8969 6.3448 5.5810 5.2987 3.8414 6.4411 5.2212 6.3744 9.5731 11.9719 1.0439 1.0392 1.0907 1.0992 1.0866 1.1014 1.0861 1.0885 1.0978 1.0875 1.0890 1.0928 1.0898 1.0903 1.0927 1.0976 1.0966 1.0916 1.0959 1.0908 1.0964 1.0974 1.0971 1.0923 1.0765
irintensity: 649.5212 0.9767 1.4158 2.1172 2.4265 2.3414 2.6850 1.5527 2.5059 0.4034 0.8117 12.0088 1.8971 1.6239 4.7578 1.7412 3.7568 1.5055 2.5638 6.6028 12.1110 8.2775 10.9170 25.8850 3.2913 2.9053 2.6297 0.2979 18.7458 1.4861 6.5397 7.2699 11.4472 10.4289 45.6922 2.3521 21.2777 0.3188 1.4075 0.1365 3.9574 38.5343 1.2154 0.5342 1.0239 2.1259 1.6664 16.5128 13.9315 28.9951 0.2477 0.3111 0.9864 105.6462 1.4619 29.7423 4.2261 0.1516 6.4889 9.3094 28.8739 27.1744 9.8956 7.4027 48.0712 69.8373 51.7563 11.4330 3.6651 0.9591 0.6727 0.0586 2.0133 0.3079 70.2054 9.3884 29.6056 9.3777 0.4090 7.4522 6.5810 0.5686 0.2595 1.1780 0.2713 11.4397 0.0628 0.7982 2.7528 0.4934 0.1911 5.0142 4.4236 0.8583 89.2737 50.3808 2.1493 26.8410 0.1137 7.2581 0.2862 14.0257 10.0119 12.0936 98.2688 5.0396 4.4556 0.0745 11.5156 0.7594 0.3685 2.2093 0.9037 5.2742 23.1992 48.1826 0.2241 21.8361 0.3239 1.3133 93.5327 1.9587 4.5934 9.6854 4.7892 70.4243 45.8610 5.1279 18.8084 50.2003 6.7816 75.6492 6.4071 7.9556 0.2379 8.6342 8.3554 16.7718 14.5050 88.6155 53.3354 252.0599 2.8375 22.3361 9.7109 4.3744 73.7580 0.6198 24.5742 13.0706 187.4241 374.0064 20.7161 1.4781 3.3030 15.0626 4.3785 0.7713 1.6561 2.4200 13.7835 0.1222 7.8129 22.9131 3.8847 4.4720 27.8203 25.2634 23.2532 3.0594 27.8326 3.0873 13.7880 12.5820 7.8848 1.3427 31.8701
temp: 298.150 k
press: 1.00000 atm
elementType: 35 6 6 6 6 8 7 1 1 1 1 1 1 1 6 6 6 6 1 6 1 6 1 1 1 6 6 6 6 6 6 6 6 6 6 1 6 6 1 1 1 1 1 1 1 7 7 29 6 6 6 6 6 6 1 6 1 6 1 1 1
symmnumber: 1
zpe: 1249830.8 jmol-1
zpe.correction: 0.476035 hartree
zpe.thermalcorrener: 0.509281 hartree
zpe.thermalcorrenthalpy: 0.510225 hartree
zpe.thermalcorrgfe: 0.406366 hartree
zpe.sumelectzpe: -1608.089826 hartree
zpe.sumelectthermal: -1608.056580 hartree
zpe.sumelectthermalent: -1608.055635 hartree
zpe.sumelectthermalfe: -1608.159495 hartree
dipole: 11.3272 -12.6620 -0.2306
dipole: 16.9907
quadrupole: -284.8362 -232.4376 -194.5432
quadrupole: 70.6207 40.9364 -37.2289
quadrupole: -47.5638 4.8347 42.7291 70.6207 40.9364 -37.2289
hfenergy: -1608.5658609 hartree
pointgroup: C01 [X(C30H25Br1Cu1N3O1)]
dipole: 4.4564466 -4.9816017 -0.0907098 debye
polarizability: 440.6702674|40.4843777|533.1108949|168.9652529|-4.6975759|596.8312254 unknown
InChI: InChI=1/C12H8N2.C10H12NO.C8H5.Br.Cu/c1-3-9-5-6-10-4-2-8-14-12(10)11(9)13-7-1;1-8(2)10(12)11-9-6-4-3-5-7-9;1-2-8-6-4-3-5-7-8;;/h1-8H;3-7,11H,1-2H3;3-7H;;/q-2;;;;+2/rC20H13CuN2.C10H12NO.Br/c1-2-6-16(7-3-1)12-13-21-22-14-4-8-17-10-11-18-9-5-15-23(21)20(18)19(17)22;1-8(2)10(12)11-9-6-4-3-5-7-9;/h1-11,14-15H;3-7,11H,1-2H3;
charge 0 multiplicity 1
61 atoms
Br -5.55262604 3.93033642 0.77688157
C  -5.30142778 1.74309755 -1.49645989
C  -5.57427101 0.79508089 -0.33816299
C  -3.98542897 2.37789849 -1.82033221
C  -6.48821597 2.20263226 -2.25580317
O  -6.5898269 0.10860231 -0.33683647
N  -4.58347827 0.73330447 0.61282271
H  -3.77190826 2.23296555 -2.88361596
H  -4.05616388 3.45428337 -1.63362429
H  -3.15826683 1.96133349 -1.24659492
H  -6.79075956 3.16062979 -1.8117471
H  -6.25071667 2.3846003 -3.30790568
H  -7.32405878 1.50934231 -2.16119502
H  -4.0401184 1.58424239 0.70431424
C  -4.51136661 -0.12888811 1.71826029
C  -3.61684526 0.21657388 2.74640418
C  -5.21736134 -1.34110024 1.79676417
C  -3.43038994 -0.63313034 3.83316933
H  -3.06868046 1.1537106 2.68671588
C  -5.01777797 -2.18208476 2.89163423
H  -5.91136912 -1.60740537 1.0124877
C  -4.12835887 -1.84100261 3.91289157
H  -2.73498705 -0.34900234 4.61801303
H  -5.56697048 -3.11855829 2.94043289
H  -3.98158255 -2.50547075 4.75968683
C  -3.140089 -4.81042713 0.96339427
C  -2.24384449 -4.57713889 1.98861384
C  -1.51694932 -3.36580812 2.01589332
C  -1.75603316 -2.44588404 0.96742124
C  -3.31102855 -3.82986392 -0.03224805
C  -0.57447079 -3.02774493 3.0445299
C  -1.05388407 -1.18590919 0.94599275
C  -0.1279097 -0.88374712 1.97402713
C  0.09198199 -1.83821291 3.02398481
C  0.52215251 0.36872076 1.9117645
H  1.23275126 0.64370168 2.6864754
C  0.24370949 1.22875909 0.8663964
C  -0.68869066 0.83581272 -0.11126476
H  -0.40657418 -3.74123449 3.84645609
H  -3.71532996 -5.72901377 0.91618647
H  -2.09395506 -5.30987082 2.77696458
H  -4.01526524 -3.96978293 -0.84664272
H  0.80028524 -1.58803387 3.80882117
H  0.72557428 2.19745475 0.78805694
H  -0.93044434 1.48661898 -0.94543734
N  -1.32693369 -0.33052096 -0.07326715
N  -2.63926444 -2.68445256 -0.03217821
Cu -2.92954457 -0.98539776 -1.27645612
C  -4.2530035 -0.49458663 -2.48117482
C  -5.2018571 -0.34737182 -3.27033411
C  -6.30033182 -0.27010715 -4.16590554
C  -7.57823696 -0.71297363 -3.75504986
C  -6.14815685 0.27819617 -5.45827576
C  -8.6649604 -0.61430935 -4.61889519
H  -7.69500722 -1.10632024 -2.75029393
C  -7.24086883 0.36599991 -6.31699459
H  -5.16786555 0.62326047 -5.77368666
C  -8.49984325 -0.07910818 -5.90102942
H  -9.64457188 -0.95244182 -4.29243627
H  -7.11346458 0.78549448 -7.31123942
H  -9.35055266 -0.00614702 -6.57312882
