program: Gaussian 09
title: Title Card Required
version: ES64L-G09RevD.01
method: RB3LYP
basis: Gen
operation: Freq
keyword: #P
keyword: Geom=AllCheck
keyword: Guess=TCheck
keyword: SCRF=Check
keyword: GenChk
keyword: RB3LYP/ChkBas
keyword: Freq
converged: YES YES NO YES
title: Mulliken charges:
elementType: C C C C C C C C C C H C C H H H H H H H N N Cu Br C C C C C C H C H C H H H C C C C O N H H H H H H H C C C C H C H C H H H
charge: -0.151427 -0.162096 0.151659 0.219940 0.024066 -0.188149 0.258531 0.154529 -0.196251 -0.160151 0.177503 -0.148920 0.078142 0.162972 0.171904 0.172583 0.197606 0.164278 0.181444 0.211214 -0.464120 -0.406350 -0.222644 -0.438335 0.117723 -0.146544 0.019460 -0.165377 -0.150658 -0.143735 0.144317 -0.144743 0.161810 -0.137719 0.141526 0.142724 0.140129 0.031718 0.578686 -0.478215 -0.479898 -0.485009 -0.670786 0.204665 0.189352 0.173445 0.181498 0.164426 0.195143 0.367732 0.325007 -0.213641 -0.182414 -0.144827 0.168738 -0.155018 0.174672 -0.138960 0.146963 0.141330 0.138555
chargesum: 0.00000
title: Mulliken charges with hydrogens summed into heavy atoms:
elementType: C C C C C C C C C C C C N N Cu Br C C C C C C C C C C C C O N C C C C C C
charge: 0.020477 0.010486 0.151659 0.219940 0.221672 -0.025177 0.258531 0.154529 -0.031974 0.017352 0.032524 0.289356 -0.464120 -0.406350 -0.222644 -0.438335 0.117723 -0.146544 0.019460 -0.021060 0.011152 -0.002209 -0.002019 0.002410 0.031718 0.578686 0.089246 0.061169 -0.485009 -0.303054 0.325007 -0.044903 -0.007742 0.002135 -0.013688 -0.000405
polarizability: 3.75191595e+02 -6.08412226e+01 5.43774488e+02 -1.79940397e+00 -1.36249198e+01 5.96355282e+02
1716.lowfreq: -10.0292 0.0002 0.0004 0.0006 0.9076 8.0904 16.5476 18.4513 21.9208
frequency: 15.9814 18.3070 21.6530 26.1834 34.1428 41.6010 46.5552 50.2914 63.9189 86.0903 87.0236 95.1753 101.8043 106.2125 115.9582 132.4983 135.6646 148.1309 155.0079 178.6480 191.7470 212.1866 226.3263 240.6781 245.2710 246.8062 262.2265 280.3996 286.2011 294.0991 301.5550 305.4876 338.1533 360.6399 369.7115 403.3572 413.6033 416.5233 423.6153 427.9148 430.3183 463.4089 478.5532 487.1413 519.7983 521.6190 524.7367 532.8833 556.2269 563.8149 568.1108 577.3411 589.4509 623.4934 630.9057 635.7100 641.3767 654.7050 707.1237 710.0032 734.9351 737.6512 744.6369 746.3381 764.6800 775.4060 777.7053 785.2051 816.5489 817.1943 838.8457 847.0964 850.8816 860.1809 863.7955 881.3679 894.8634 918.1632 920.9461 930.0509 967.1112 967.5177 969.9213 973.4091 974.6366 978.0951 985.7520 997.1365 999.9917 1004.0632 1007.5409 1013.4553 1014.1111 1016.1205 1056.9483 1057.2613 1062.5199 1084.6503 1107.4804 1111.6691 1120.2970 1126.6500 1133.7028 1176.8280 1179.5544 1186.4064 1196.3065 1201.0123 1215.0649 1215.5475 1222.9339 1242.3287 1249.1642 1250.7435 1261.0271 1284.2714 1291.8924 1303.4963 1325.9905 1352.4269 1358.6324 1364.8802 1370.7247 1375.0425 1393.6706 1425.4716 1441.9440 1451.2847 1461.1687 1472.8179 1486.5917 1489.0528 1496.7556 1497.9859 1499.3496 1518.3030 1525.5632 1538.3285 1545.9074 1547.8863 1565.3840 1596.8404 1624.4921 1630.0974 1646.8270 1656.2997 1658.0716 1660.2989 1663.2594 1674.4147 1731.4783 2233.9657 3019.7923 3039.0120 3118.9019 3129.1677 3182.4466 3183.9675 3190.1155 3190.4487 3194.1927 3198.4972 3199.7992 3200.3256 3200.8661 3204.4662 3206.8066 3208.5196 3209.4368 3213.6959 3215.5113 3216.4530 3231.5018 3235.3052 3255.1001 3271.5790 3496.1178
redmass: 7.3591 6.2102 6.3800 6.2784 6.0964 4.6183 6.3066 3.9363 6.6175 8.0149 6.2275 6.1071 4.6989 7.7235 6.5510 5.8606 7.8679 6.2545 7.7102 6.1847 4.0011 3.9041 2.4481 2.8111 3.7480 2.8328 4.0710 2.2672 2.8724 4.5124 3.7076 3.9125 4.3462 4.3665 5.5851 3.6093 5.8465 3.0710 3.0850 4.3889 6.4015 3.9077 2.4711 6.7101 3.7730 4.3048 3.0472 7.8073 3.8056 3.1280 7.5136 8.4568 5.0937 4.0332 6.0367 6.5761 4.5244 8.1583 2.0391 1.9961 1.9966 5.7604 3.6404 5.6677 1.9673 1.7139 1.7647 1.2036 5.9909 1.3794 5.2427 6.6495 1.2569 1.2454 1.6475 6.4278 4.5552 1.4593 5.1722 1.4161 1.4450 1.5206 1.3358 1.3454 1.3618 2.0862 1.3314 1.2498 1.2591 1.3505 1.3578 6.1425 6.0435 1.2730 2.4347 4.4004 2.2004 2.6051 1.5744 1.6026 2.2932 1.5793 2.0994 1.2481 2.9573 1.2361 1.0968 1.1095 1.1627 2.7853 1.1785 3.1598 3.8734 1.5818 1.8074 3.1561 2.8171 1.8576 3.2563 3.8143 2.3923 1.7225 5.7698 2.1655 2.3158 1.2175 1.1866 4.1857 1.8139 2.3021 2.2186 1.9891 2.4228 1.1428 1.0619 1.0727 1.0530 2.1968 3.2145 2.2502 4.1208 2.0242 5.0886 6.1570 5.4057 4.8154 4.1877 6.3223 4.6412 6.3622 6.9932 11.9930 1.0562 1.0564 1.0839 1.0821 1.0856 1.0863 1.0885 1.0886 1.0969 1.0875 1.0929 1.0931 1.0893 1.0921 1.0971 1.0951 1.0907 1.0976 1.0966 1.0971 1.0965 1.0934 1.0953 1.0920 1.0786
irintensity: 1.1469 0.7439 0.8738 1.3626 1.3358 1.0557 0.9325 0.1969 0.4043 1.1671 1.6316 1.5531 0.9347 6.6808 7.5393 4.4187 3.6745 0.4606 13.7868 10.9339 4.3169 10.6100 6.9919 3.2065 5.5989 0.2104 6.5798 2.5680 3.3823 7.7446 7.7478 9.9160 4.1447 3.1383 9.2824 11.7869 3.9853 0.3942 0.3524 0.8730 6.9216 1.0591 9.0012 1.0079 1.9379 1.7008 3.1758 5.3173 5.3275 0.3832 0.1438 1.9143 22.6455 0.6139 1.5182 0.1173 2.3214 9.6829 21.1407 14.8843 25.2948 15.4906 21.2382 10.1481 41.5625 58.5700 40.3030 9.7254 14.9209 0.9564 0.0695 0.1513 0.4721 0.0455 67.4039 10.3230 16.7660 9.7002 0.3688 3.6319 5.1607 3.9488 0.5279 0.2642 2.1680 37.3934 0.1428 1.7401 0.2285 1.2178 0.1145 0.0318 0.4295 1.9871 9.6117 1.0261 3.2585 1.2002 212.7750 6.4037 1.1935 11.4024 19.8507 12.3232 99.5508 3.7913 0.0212 3.2700 0.6356 22.6388 3.2629 0.6125 27.5328 3.3050 4.9399 88.5082 98.4509 0.7373 0.2316 1.0606 117.2373 0.4169 4.5572 6.8835 6.3919 3.0339 15.4009 5.9330 1.2348 68.6855 6.8297 61.4663 2.8026 2.8826 7.3659 7.5705 14.8232 45.7581 16.3822 120.6277 85.1934 310.4946 2.8189 21.0822 13.8055 33.6601 135.2648 0.5063 9.4512 11.2843 285.6882 33.5798 27.1090 59.3012 12.0805 14.9430 5.9797 6.4151 4.1232 5.8282 17.7853 0.0911 57.9668 1.6923 5.6683 6.3676 13.4691 34.4535 4.6432 32.0629 26.8429 16.4909 15.2254 4.0596 1.0550 1.5102 201.8915
temp: 298.150 k
press: 1.00000 atm
elementType: 6 6 6 6 6 6 6 6 6 6 1 6 6 1 1 1 1 1 1 1 7 7 29 35 6 6 6 6 6 6 1 6 1 6 1 1 1 6 6 6 6 8 7 1 1 1 1 1 1 1 6 6 6 6 1 6 1 6 1 1 1
symmnumber: 1
zpe: 1258055.3 jmol-1
zpe.correction: 0.479168 hartree
zpe.thermalcorrener: 0.511963 hartree
zpe.thermalcorrenthalpy: 0.512907 hartree
zpe.thermalcorrgfe: 0.411302 hartree
zpe.sumelectzpe: -1608.100743 hartree
zpe.sumelectthermal: -1608.067949 hartree
zpe.sumelectthermalent: -1608.067004 hartree
zpe.sumelectthermalfe: -1608.168610 hartree
dipole: 5.3005 -2.2356 7.2290
dipole: 9.2386
quadrupole: -271.0574 -199.8589 -187.7820
quadrupole: -17.5638 -42.1796 -19.1306
quadrupole: -51.4913 19.7072 31.7841 -17.5638 -42.1796 -19.1306
hfenergy: -1608.5799113 hartree
pointgroup: C01 [X(C30H25Br1Cu1N3O1)]
dipole: 2.0853954 -0.8795401 2.8441079 debye
polarizability: 375.191595|-60.8412226|543.7744878|-1.799404|-13.6249198|596.3552817 unknown
InChI: InChI=1/C12H8N2.C10H12NO.C8H5.BrH.Cu/c1-3-9-5-6-10-4-2-8-14-12(10)11(9)13-7-1;1-8(2)10(12)11-9-6-4-3-5-7-9;1-2-8-6-4-3-5-7-8;;/h1-8H;3-7,11H,1-2H3;3-7H;1H;/q-1;;;;+2/p-1/rC30H25BrCuN3O/c1-30(2,29(36)34-26-15-7-4-8-16-26)32(31,20-19-23-11-5-3-6-12-23)35-22-10-14-25-18-17-24-13-9-21-33-27(24)28(25)35/h3-18,21-22,34H,1-2H3
charge 0 multiplicity 1
61 atoms
C  -2.217303 -4.44879677 0.34651742
C  -2.57211586 -4.52569787 1.67934368
C  -3.30965031 -3.47238999 2.26737125
C  -3.64041621 -2.37419364 1.43409446
C  -2.59292276 -3.30945748 -0.39434864
C  -3.73608687 -3.47356023 3.63749776
C  -4.421661 -1.28569856 1.96939381
C  -4.84121684 -1.32361097 3.32145534
C  -4.47016331 -2.44165909 4.14233909
C  -5.62693291 -0.24850606 3.79405409
H  -5.96546308 -0.24789349 4.82647969
C  -5.96228173 0.7803196 2.93707421
C  -5.50507947 0.73882948 1.6095629
H  -3.46827307 -4.32043205 4.2632437
H  -1.66007984 -5.24563857 -0.13510193
H  -2.29968048 -5.38866912 2.28115179
H  -2.33678742 -3.21245622 -1.44628147
H  -4.79761482 -2.4499823 5.17810201
H  -6.57045423 1.6167783 3.26311719
H  -5.75386047 1.5259655 0.90884936
N  -4.75168367 -0.25350968 1.14732507
N  -3.27364038 -2.30517212 0.13472567
Cu -4.27323318 -0.42588832 -0.79844675
Br -6.44312924 -1.68133933 -1.07508106
C  -4.11573649 -0.29705226 -2.63512653
C  -4.12100581 -0.18774853 -3.85355086
C  -4.14313133 -0.06710493 -5.27679017
C  -3.84985655 1.16377928 -5.8997008
C  -4.46691544 -1.17473019 -6.08703384
C  -3.88295528 1.28051092 -7.28794965
H  -3.59969928 2.02432568 -5.28494286
C  -4.49201264 -1.05111928 -7.47448248
H  -4.70077704 -2.12333581 -5.61311524
C  -4.20229883 0.17474245 -8.08106514
H  -3.65774328 2.23712682 -7.75237654
H  -4.74385985 -1.9143265 -8.08516657
H  -4.22646314 0.2678358 -9.16351167
C  -2.67822016 1.005125 -0.68099661
C  -3.52916997 2.24391344 -0.45387243
C  -1.90157967 0.58037855 0.55129421
C  -1.74024013 1.10269609 -1.87876099
O  -3.48847733 2.85050425 0.61804547
N  -4.31601176 2.6093567 -1.51613137
H  -2.49750764 0.59840198 1.46046557
H  -1.47757399 -0.41626742 0.40853354
H  -1.06629534 1.28061417 0.69647016
H  -2.2143345 1.46710101 -2.78756303
H  -0.93188648 1.80163841 -1.61260774
H  -1.28614653 0.13221121 -2.09679541
H  -4.35529366 1.93022232 -2.27345403
C  -5.26002358 3.65025141 -1.60156538
C  -6.12145321 3.63429784 -2.71369497
C  -5.37282884 4.68089507 -0.65357422
C  -7.07928331 4.63103316 -2.87462932
H  -6.04069329 2.83145149 -3.44301059
C  -6.341034 5.6711866 -0.83042448
H  -4.71207283 4.69686475 0.20128017
C  -7.1970933 5.6575065 -1.93286902
H  -7.73869394 4.60014923 -3.73776787
H  -6.42044412 6.46458225 -0.09149809
H  -7.94632334 6.43412351 -2.05782185
