program: Gaussian 09
title: Title Card Required
version: ES64L-G09RevD.01
method: RB3LYP
basis: Gen
operation: Freq
keyword: #P
keyword: Geom=AllCheck
keyword: Guess=TCheck
keyword: SCRF=Check
keyword: GenChk
keyword: RB3LYP/ChkBas
keyword: Freq
converged: YES YES NO NO
title: Mulliken charges:
elementType: Br C C C C O N H H H H H H H C C C C H C H C H H H C C C C C C C C C C H C C H H H H H H H N N Cu C C C C C C H C H C H H H
charge: -0.428453 -0.037787 0.593085 -0.483793 -0.462995 -0.470134 -0.632853 0.270110 0.218913 0.170298 0.211114 0.187526 0.241008 0.363484 0.341639 -0.211105 -0.173239 -0.141614 0.145811 -0.154944 0.187367 -0.139854 0.143883 0.145428 0.140469 -0.153136 -0.160524 0.162678 0.237675 0.058418 -0.190678 0.200712 0.154540 -0.190936 -0.165361 0.174454 -0.153360 0.011633 0.163601 0.175609 0.174165 0.212497 0.161926 0.173667 0.187526 -0.418977 -0.475149 -0.205526 0.033468 -0.170916 0.025893 -0.157747 -0.159679 -0.146236 0.146965 -0.145381 0.144974 -0.140840 0.138295 0.136404 0.135986
chargesum: 0.00000
title: Mulliken charges with hydrogens summed into heavy atoms:
elementType: Br C C C C O N C C C C C C C C C C C C C C C C C C N N Cu C C C C C C C C
charge: -0.428453 -0.037787 0.593085 0.175528 0.176653 -0.470134 -0.269369 0.341639 -0.065294 0.014128 0.002268 -0.009517 0.000615 0.022472 0.013641 0.162678 0.237675 0.270915 -0.027076 0.200712 0.154540 -0.029011 0.009093 0.020307 0.199158 -0.418977 -0.475149 -0.205526 0.033468 -0.170916 0.025893 -0.010782 -0.014704 -0.007942 -0.008977 -0.004854
polarizability: 5.00319931e+02 -1.94644112e+01 4.31645277e+02 6.83024250e+01 -6.57866015e+01 5.82666667e+02
1716.lowfreq: -164.6274 -19.0685 -13.6699 -0.0575 0.0004 0.0005 6.1064 15.2395 17.1234
frequency: -164.6261 12.9256 14.2408 22.2667 32.6297 40.5078 46.7668 48.9152 52.9984 72.9826 77.9387 84.4104 88.3626 97.0607 101.4471 108.0480 131.4619 134.9460 137.1526 145.3877 161.9732 181.3670 184.7185 205.8384 226.6882 239.5203 243.9875 259.7294 265.0210 275.4754 285.9669 296.4886 315.4565 335.3479 356.4574 383.7600 391.6562 417.4331 420.7307 425.5637 426.7704 437.1040 453.5616 484.5733 515.0461 518.7357 523.5563 524.6578 554.6631 555.9876 561.3246 562.4239 567.1772 570.7635 615.5552 619.5155 633.6878 635.7480 648.2535 680.4902 708.7347 709.1467 736.6900 740.0923 745.5021 770.9001 778.2775 784.7896 807.2398 819.0940 828.4920 845.3517 853.4504 856.3900 864.4499 876.6450 878.4936 914.5202 919.1058 924.6448 960.7748 964.4917 968.5072 968.8645 975.7556 977.9038 985.2405 994.9870 996.9577 1001.5840 1007.3963 1013.0089 1014.6144 1019.2683 1057.6318 1057.9692 1062.8198 1083.5101 1090.8694 1110.5676 1116.0410 1125.4966 1132.3423 1174.5488 1175.8900 1186.4976 1194.8190 1199.9907 1214.0439 1220.0718 1242.5392 1242.7205 1242.9844 1250.7419 1260.5893 1271.4308 1292.9818 1300.4622 1324.1471 1349.3918 1359.5774 1365.0452 1369.9385 1375.1331 1387.9680 1437.4653 1448.8856 1449.5028 1461.1838 1469.6602 1481.5557 1485.6250 1486.7204 1494.0957 1495.4512 1509.0177 1523.1596 1537.5311 1544.4218 1546.2882 1562.5512 1581.2846 1622.9259 1625.0982 1644.2034 1651.8547 1655.7174 1658.3884 1661.5277 1674.1893 1725.5601 2190.5353 3077.2009 3089.5418 3140.3206 3152.2671 3161.9006 3174.6000 3181.4253 3189.2395 3191.8999 3193.3561 3196.7993 3201.5439 3201.8696 3202.1912 3205.3464 3206.0204 3208.1389 3213.5560 3214.2399 3216.2206 3229.9157 3230.6331 3247.8781 3285.4000 3630.4689
redmass: 7.9079 7.6682 6.7921 7.4427 6.8342 6.5844 7.2449 3.7784 5.6815 4.2204 6.1373 7.4310 6.0250 6.6548 7.5901 7.9620 4.5985 6.1450 5.9245 5.9500 6.7647 1.2750 4.3264 1.5065 4.3541 7.4773 3.6517 4.9743 3.5286 6.0909 5.3281 4.7199 2.6709 3.9281 2.9447 4.5534 5.2646 3.0116 3.8975 3.2186 6.9873 3.4743 3.9304 6.7761 3.3187 2.4923 4.7487 7.7156 3.8414 4.6327 3.1286 7.1074 7.2100 1.4239 5.3437 3.9199 6.4564 6.5853 8.1697 6.3998 2.2250 1.8586 6.5444 6.3723 3.5364 1.6343 1.8544 1.1990 6.2782 1.3636 5.2032 5.3326 1.3047 1.2494 1.6548 4.8708 6.4922 5.2785 1.4022 1.4440 2.3032 1.3907 1.3465 1.3139 1.3623 1.4862 1.3292 1.2537 1.2574 1.3467 1.3518 6.2041 5.7815 1.2323 2.2256 5.5051 2.2110 2.5313 1.4051 1.6058 2.3186 1.5779 2.1480 2.9392 1.2519 1.2421 1.0964 1.0975 1.1388 1.1471 3.5996 3.5800 3.7052 1.4986 1.7972 2.4878 3.0910 1.8352 3.3532 3.7050 2.1544 1.6991 6.5109 2.4260 2.2081 1.2047 1.1822 4.2121 1.9031 2.1448 1.0801 1.9564 2.2243 1.1963 2.0807 1.0621 1.1040 2.1808 3.2278 2.2435 4.1702 1.8923 5.0400 6.1463 5.4761 4.0484 5.4405 6.3301 5.3086 6.3167 8.7112 11.9958 1.0368 1.0366 1.0991 1.1005 1.1035 1.0890 1.0850 1.0881 1.0871 1.1027 1.0873 1.0918 1.0890 1.0923 1.0904 1.0918 1.0943 1.0967 1.0978 1.0974 1.0970 1.0928 1.0956 1.0919 1.0767
irintensity: 514.1015 0.8795 0.0856 0.2441 0.1410 0.1408 4.5850 0.1876 0.5600 0.4988 3.2731 3.7133 5.3257 1.0319 6.6939 2.4791 5.1013 15.3579 7.1393 1.9189 17.6991 1.9095 2.2024 2.5854 22.0324 31.3293 2.5428 3.1518 1.4701 18.7083 16.6297 1.4127 3.5921 3.4579 63.1831 13.1118 5.0839 0.0158 0.1110 0.1288 5.3080 10.4921 3.5482 0.8083 4.0158 18.2681 1.2684 2.1573 1.8591 24.4972 1.2267 0.6760 0.5513 59.9896 10.1918 0.5497 0.9363 0.0202 8.5651 13.3894 20.3667 25.7323 8.7546 8.8516 55.4308 58.3120 42.6531 9.6136 16.6057 0.6892 4.1418 0.4119 1.3930 0.0035 59.7330 15.8662 7.8035 0.0897 13.2870 4.7295 6.8432 1.7607 0.0012 0.0469 0.3501 2.5642 0.0515 0.1809 1.9713 0.9661 0.6897 0.2068 0.1933 2.4922 9.2674 0.1440 1.5140 1.0393 144.6724 7.4662 0.9243 19.5380 13.7456 108.7898 13.7141 1.2522 0.0578 1.4718 1.2551 2.0380 22.7463 16.6235 28.5047 0.7176 5.6653 6.0123 34.9690 0.1881 0.0988 2.6212 68.8856 0.0360 4.1669 6.6591 5.6848 33.2901 24.1662 5.1513 6.8577 65.9944 12.1136 76.7801 2.1228 7.3279 0.0801 9.2073 2.6848 58.2596 10.9492 70.6457 53.8193 270.0929 3.8706 17.8730 7.4171 64.5810 50.3530 0.3543 15.4999 13.6642 159.8643 38.8764 10.3681 6.7680 21.7485 9.7106 25.4182 8.2895 5.4316 7.5747 0.5035 2.9522 0.3500 34.7615 1.9601 24.2017 4.8357 6.8200 39.0343 19.1536 21.2911 33.6943 12.8836 4.5238 3.1839 3.6111 25.6186
temp: 298.150 k
press: 1.00000 atm
elementType: 35 6 6 6 6 8 7 1 1 1 1 1 1 1 6 6 6 6 1 6 1 6 1 1 1 6 6 6 6 6 6 6 6 6 6 1 6 6 1 1 1 1 1 1 1 7 7 29 6 6 6 6 6 6 1 6 1 6 1 1 1
symmnumber: 1
zpe: 1252069.8 jmol-1
zpe.correction: 0.476888 hartree
zpe.thermalcorrener: 0.509882 hartree
zpe.thermalcorrenthalpy: 0.510826 hartree
zpe.thermalcorrgfe: 0.408486 hartree
zpe.sumelectzpe: -1608.075510 hartree
zpe.sumelectthermal: -1608.042516 hartree
zpe.sumelectthermalent: -1608.041571 hartree
zpe.sumelectthermalfe: -1608.143912 hartree
dipole: 13.1672 -5.1227 3.3798
dipole: 14.5272
quadrupole: -315.4312 -203.4805 -233.8942
quadrupole: 32.6451 9.5079 -27.4779
quadrupole: -64.4959 47.4548 17.0411 32.6451 9.5079 -27.4779
hfenergy: -1608.5523979 hartree
pointgroup: C01 [X(C30H25Br1Cu1N3O1)]
dipole: 5.1803938 -2.0154153 1.3296963 debye
polarizability: 500.3199309|-19.4644112|431.6452769|68.302425|-65.7866015|582.6666674 unknown
InChI: InChI=1/C12H8N2.C10H12NO.C8H5.Br.Cu/c1-3-9-5-6-10-4-2-8-14-12(10)11(9)13-7-1;1-8(2)10(12)11-9-6-4-3-5-7-9;1-2-8-6-4-3-5-7-8;;/h1-8H;3-7,11H,1-2H3;3-7H;;/q-1;;;;+1/rC20H13CuN2.C10H12NO.Br/c1-2-6-16(7-3-1)12-13-21-23-15-5-9-18-11-10-17-8-4-14-22-19(17)20(18)23;1-8(2)10(12)11-9-6-4-3-5-7-9;/h1-11,14-15H;3-7,11H,1-2H3;
charge 0 multiplicity 1
61 atoms
Br -7.17599677 2.50752304 1.81516443
C  -6.06922443 1.02143413 0.07627031
C  -5.74016704 0.05685579 1.21902978
C  -5.18570898 2.14158333 -0.45639896
C  -7.34421697 0.71603256 -0.67803352
O  -6.46532602 -0.91156713 1.43889219
N  -4.61551291 0.3614182 1.94126759
H  -4.74623342 1.86538441 -1.41859275
H  -5.80385593 3.02291437 -0.63833391
H  -4.38310994 2.42964218 0.22457793
H  -8.07174408 0.24172326 -0.02080591
H  -7.75802428 1.63996126 -1.08813914
H  -7.1408726 0.04458798 -1.51494569
H  -4.12809135 1.20249102 1.66962427
C  -4.05996563 -0.31026277 3.03917027
C  -2.84737752 0.19580084 3.54367319
C  -4.62911518 -1.45333031 3.62508104
C  -2.21130767 -0.43193495 4.60970223
H  -2.40624476 1.08148382 3.09116801
C  -3.97602566 -2.07117251 4.69202439
H  -5.56231657 -1.83957218 3.24355388
C  -2.77022337 -1.57432587 5.19014195
H  -1.27513311 -0.02783274 4.98505937
H  -4.42481115 -2.95477366 5.13819271
H  -2.2742602 -2.0657958 6.02224876
C  -4.09848187 -4.2314859 1.24230053
C  -2.77967028 -4.20802658 1.65028717
C  -1.98327861 -3.07683258 1.36653208
C  -2.59247351 -2.00739674 0.66391801
C  -4.61706112 -3.12449487 0.5480471
C  -0.60786065 -2.97018072 1.76322013
C  -1.82149051 -0.82153792 0.36514482
C  -0.46230796 -0.75371297 0.76862294
C  0.12374975 -1.85769793 1.47367934
C  0.24844326 0.42588581 0.45359102
H  1.29058042 0.51744764 0.74783638
C  -0.38973768 1.44508175 -0.22703944
C  -1.74215947 1.28051962 -0.58289427
H  -0.16124179 -3.80115432 2.30201866
H  -4.73963205 -5.08160057 1.44919517
H  -2.34595661 -5.04464373 2.19115296
H  -5.65132046 -3.09391771 0.22564461
H  1.16505261 -1.78541475 1.77535049
H  0.12949199 2.36132418 -0.48841166
H  -2.27483542 2.06005406 -1.12079333
N  -2.44008527 0.19057099 -0.28988002
N  -3.88845879 -2.04942017 0.26367531
Cu -4.56120724 -0.49575641 -0.95213353
C  -5.08014572 -0.2849161 -2.75200969
C  -5.36452037 -0.14481453 -3.94107997
C  -5.71788007 0.01415264 -5.3163446
C  -7.07132985 0.02079546 -5.71674455
C  -4.72638519 0.17075939 -6.30848291
C  -7.41614304 0.17992589 -7.05730119
H  -7.84397537 -0.10052555 -4.96284581
C  -5.07865163 0.32879103 -7.64742125
H  -3.68082934 0.16481699 -6.01353422
C  -6.42338785 0.33490482 -8.02944871
H  -8.46469376 0.18229729 -7.34471714
H  -4.29991086 0.44671878 -8.39699501
H  -6.69519027 0.45787464 -9.07455735
