program: Gaussian 09
title: Title
version: ES64L-G09RevD.01
method: UB3LYP
basis: Gen
operation: Freq
keyword: #P
keyword: Geom=AllCheck
keyword: Guess=TCheck
keyword: SCRF=Check
keyword: GenChk
keyword: UB3LYP/ChkBas
keyword: Freq
converged: YES YES NO YES
polarizability: 3.81545104e+02 6.19846139e+01 3.48324493e+02 1.47752083e+02 -2.11026526e+01 3.03364037e+02
1716.lowfreq: -7.9653 0.0003 0.0005 0.0007 6.3071 13.8762 16.0828 22.0429 24.4782
frequency: 13.2001 18.0613 22.0015 33.3387 65.6653 94.1981 99.1804 105.7371 127.5666 143.0600 151.8943 166.6631 216.8883 241.1249 253.7629 260.1100 268.0209 283.9692 302.9913 403.8903 413.0295 423.0339 431.8418 454.4718 493.0446 516.3750 522.3267 531.3650 554.9986 560.9363 562.3986 570.6532 619.1242 635.2511 654.3367 706.8593 737.8543 740.5104 746.5992 775.2132 791.2133 808.6368 820.0218 847.5896 856.5521 868.9352 883.0460 917.9025 924.3365 968.2640 981.7386 989.0153 994.9743 995.7334 1012.0595 1012.9596 1015.2620 1056.3888 1057.1351 1084.5510 1109.7304 1117.9860 1134.8986 1179.4110 1185.4405 1194.9270 1214.6994 1244.1052 1245.8199 1252.1063 1258.5303 1294.4919 1324.7964 1357.8916 1363.9119 1373.8234 1388.1979 1458.4502 1460.9733 1470.6914 1485.7358 1497.4023 1537.4357 1543.0928 1566.2371 1623.2782 1631.0568 1644.4474 1656.4375 1659.1574 1673.9932 2216.5272 3180.7553 3188.6097 3201.2991 3201.3295 3208.1025 3208.4856 3209.9371 3214.2944 3217.5982 3226.1962 3231.6699 3238.4869 3242.7582
redmass: 5.1262 5.0579 6.2603 9.6083 6.7992 7.3610 7.3023 5.8782 8.4227 7.5439 6.3908 6.6548 20.7891 3.6040 7.6085 5.7380 16.0585 8.6241 5.7768 6.0966 3.0297 3.9983 7.0649 4.0268 6.8761 3.4684 4.5371 7.8968 3.8731 3.4728 6.5635 7.4985 3.9253 6.5710 8.1804 1.9594 6.1778 3.5360 6.6710 1.7821 1.1981 6.2796 1.4615 4.9116 1.2472 1.6276 6.4693 5.1997 1.4251 1.3425 1.3294 1.3477 1.2513 1.3660 1.3601 6.1458 1.3666 5.1821 2.2379 2.4928 1.6021 2.2829 2.1430 1.2606 1.2204 1.0944 1.1376 3.8888 3.1471 1.4799 1.8003 1.7729 3.2901 3.8945 1.7114 5.8124 2.3485 2.0554 3.7247 2.0763 2.2392 3.2373 2.1930 3.2843 4.2859 5.1055 6.3547 5.6480 5.4535 6.6332 6.5262 11.9991 1.0853 1.0885 1.0878 1.0921 1.0947 1.0907 1.0903 1.0974 1.0965 1.0917 1.0921 1.0970 1.0966
irintensity: 1.2692 0.6940 1.2961 0.6898 2.2044 2.6672 1.3011 1.3286 0.9772 0.8862 2.2559 2.2573 35.3411 3.3287 10.6822 3.9626 21.3933 12.2938 14.4031 4.8303 0.0071 0.4161 13.0692 0.2038 1.6744 0.0222 2.0001 1.2850 5.1881 1.0546 7.3144 0.4770 0.3410 0.0022 12.2166 23.0624 13.3619 42.9970 19.1491 43.7110 9.1669 30.0157 0.0474 0.0331 0.0556 74.4371 18.3914 0.1432 4.3315 0.0293 0.9639 0.9718 0.1587 0.5109 1.6624 0.0844 0.5238 0.7399 9.1667 0.7458 6.8024 0.2173 34.4928 14.8625 2.8361 0.0552 1.1673 55.7285 0.4068 5.1325 8.5430 0.8553 0.1023 2.5441 0.0406 9.5885 25.9320 12.9015 9.5835 62.7981 3.0342 1.4213 52.4879 14.7271 83.1933 3.0047 21.4230 20.8388 40.3410 0.2055 7.8408 7.4823 4.4136 8.9328 0.3160 34.6635 37.0877 5.7698 6.4438 16.7431 19.8169 4.0808 2.2174 13.4696 12.4210
temp: 298.150 k
press: 1.00000 atm
elementType: 29 6 6 6 6 6 1 6 6 6 1 6 6 6 1 1 6 1 1 1 1 7 7 35 6 6 6 6 6 6 1 6 1 6 1 1 1
symmnumber: 1
zpe: 723400.2 jmol-1
zpe.correction: 0.275529 hartree
zpe.thermalcorrener: 0.296038 hartree
zpe.thermalcorrenthalpy: 0.296982 hartree
zpe.thermalcorrgfe: 0.221067 hartree
zpe.sumelectzpe: -1090.010640 hartree
zpe.sumelectthermal: -1089.990131 hartree
zpe.sumelectthermalent: -1089.989187 hartree
zpe.sumelectthermalfe: -1090.065102 hartree
dipole: -3.7768 -15.4019 -1.9471
dipole: 15.9773
quadrupole: -140.0281 -138.9207 -122.8472
quadrupole: 11.5933 25.0766 24.7755
quadrupole: -6.0961 -4.9887 11.0848 11.5933 25.0766 24.7755
hfenergy: -1090.286169 hartree
pointgroup: C01 [X(C20H13Br1Cu1N2)]
dipole: -1.4858939 -6.0595598 -0.7660545 debye
polarizability: 381.5451044|61.9846139|348.3244926|147.752083|-21.1026526|303.3640369 unknown
InChI: InChI=1/C12H8N2.C8H5.BrH.Cu/c1-3-9-5-6-10-4-2-8-14-12(10)11(9)13-7-1;1-2-8-6-4-3-5-7-8;;/h1-8H;3-7H;1H;/q-2;;;+3/p-1/rC20H13BrCuN2/c21-22(13-12-16-6-2-1-3-7-16)23-14-4-8-17-10-11-18-9-5-15-24(22)20(18)19(17)23/h1-11,14-15H
charge 0 multiplicity 2
37 atoms
Cu 0.28378616 0.51165738 -1.96168618
C  -0.38867527 -2.3400263 -1.74915559
C  1.25282721 -1.86491676 -0.18768358
C  -1.22376734 -1.8420177 -2.80605019
C  -0.46082613 -3.69897517 -1.36550456
C  1.24708502 -3.1969242 0.2702498
H  1.91470146 -1.11011855 0.22510145
C  -2.11187831 -2.71945782 -3.47009092
C  -1.378091 -4.56530419 -2.05122976
C  0.3934842 -4.11217743 -0.31685407
H  1.91490879 -3.48647917 1.07440703
C  -2.89497631 -2.17348419 -4.51249943
C  -2.16780612 -4.09546604 -3.0605176
C  -1.86096613 -0.03686496 -4.10535522
H  -1.42950459 -5.6077902 -1.75043112
H  0.37293895 -5.14641712 0.01565985
C  -2.76421918 -0.83571618 -4.83128044
H  -3.59088681 -2.81020306 -5.05185904
H  -2.85624572 -4.75952555 -3.57543935
H  -1.7465125 1.02261061 -4.30515646
H  -3.34839902 -0.38555115 -5.62653296
N  0.45375076 -1.45612307 -1.16460775
N  -1.11242349 -0.52455951 -3.12097525
Br -0.8633753 2.69172033 -2.18234287
C  1.93185434 1.14294548 -1.24588632
C  3.00657762 1.49493082 -0.77051094
C  4.26672647 1.89342536 -0.22726695
C  5.32641914 2.28406072 -1.07231166
C  4.4819016 1.89882779 1.16680765
C  6.55601772 2.66417955 -0.53834823
H  5.16913981 2.28704232 -2.14690271
C  5.71390025 2.28185442 1.69324476
H  3.67017169 1.6055447 1.82656404
C  6.75687585 2.66513014 0.84507781
H  7.3607092 2.96357023 -1.20522289
H  5.86023553 2.28300042 2.77051309
H  7.71651978 2.96419649 1.25831789
