program: Gaussian 09
title: Title Card Required
version: ES64L-G09RevD.01
method: RB3LYP
basis: Gen
operation: Freq
keyword: #P
keyword: Geom=AllCheck
keyword: Guess=TCheck
keyword: SCRF=Check
keyword: GenChk
keyword: RB3LYP/ChkBas
keyword: Freq
converged: YES YES NO NO
title: Mulliken charges:
elementType: Cu C C C C C C C C C C H C C H H H H H H H N N O C O O Cs C C H C C C C H C H C H H H
charge: 0.040570 -0.153695 -0.171570 0.164602 0.225444 0.030617 -0.194229 0.211770 0.158735 -0.197236 -0.174070 0.161968 -0.158797 0.024607 0.152622 0.161634 0.161273 0.191892 0.152277 0.162156 0.192666 -0.416366 -0.434511 -0.535581 0.677051 -0.706847 -0.641404 0.884686 0.103331 -0.436670 0.401956 -0.002268 -0.155474 -0.160163 -0.144803 0.150230 -0.141543 0.154073 -0.142289 0.135330 0.135028 0.132997
chargesum: 0.00000
title: Mulliken charges with hydrogens summed into heavy atoms:
elementType: Cu C C C C C C C C C C C C N N O C O O Cs C C C C C C C C
charge: 0.040570 0.007939 -0.010298 0.164602 0.225444 0.222509 -0.041607 0.211770 0.158735 -0.044959 -0.012101 0.003360 0.217273 -0.416366 -0.434511 -0.535581 0.677051 -0.706847 -0.641404 0.884686 0.103331 -0.034714 -0.002268 -0.005244 -0.006089 -0.009473 -0.006515 -0.009292
polarizability: 3.95292040e+02 4.33085049e+01 3.64011431e+02 1.04588356e+02 -3.39887649e+01 2.58469598e+02
1716.lowfreq: -698.3486 -0.6112 0.0003 0.0006 0.0008 4.1298 10.4886 12.7591 21.5164
frequency: -698.3485 11.7271 21.2293 28.2025 34.0114 39.0877 44.6254 55.0840 66.1563 69.0138 73.8603 77.4010 84.8999 111.7189 112.9961 133.6370 141.8206 156.3011 171.1903 176.4613 240.4312 257.2137 262.8882 279.2297 317.4576 353.7865 366.1078 417.6584 418.0829 425.9082 451.6972 480.8507 510.2563 511.6248 519.8679 544.9100 561.6651 566.2453 569.1139 616.1864 634.7082 640.1599 694.4255 704.3861 731.0365 733.5394 738.2729 743.6693 769.1611 778.2499 814.4364 827.4387 834.0952 843.3291 852.4625 859.1085 877.3405 907.9268 917.3882 959.4725 962.3998 966.2826 976.8256 987.6928 992.4523 996.2548 1013.3930 1055.1894 1055.9714 1062.6582 1067.8512 1077.7517 1109.3421 1109.6198 1124.7003 1170.6278 1180.9927 1192.8171 1211.4196 1238.4324 1241.1628 1243.9837 1256.2118 1295.3222 1324.7400 1344.3185 1356.6469 1362.6617 1369.4791 1382.7571 1448.5792 1456.8371 1465.4394 1484.4109 1488.3578 1516.6713 1539.2736 1542.2533 1553.6258 1614.7738 1616.0876 1620.3342 1637.1682 1653.1198 1654.3091 1672.1844 2199.8285 3179.6297 3187.4413 3188.6787 3195.5471 3197.7585 3202.2250 3205.0138 3205.6729 3209.5699 3211.6027 3215.7770 3223.3229 3226.8077
redmass: 1.2812 10.6956 7.8830 7.7181 9.3264 6.0761 11.0445 13.3635 4.9712 9.9728 6.4431 6.4415 8.5004 11.8938 6.4611 12.2563 5.1375 7.1908 7.5923 8.8873 3.5987 5.3473 8.2580 5.4262 11.0197 9.3702 6.0903 4.0021 3.0291 6.9857 4.0631 6.5852 4.4189 4.9386 4.7069 3.5667 3.2214 7.1434 7.3362 3.9175 6.5500 8.0599 10.9283 1.9847 6.6177 11.9990 6.0936 3.5918 1.7887 1.1971 1.3349 6.5427 11.0397 7.2012 1.2600 1.6763 6.4456 5.2392 1.4195 1.3496 1.3884 1.3451 1.3294 1.2405 1.3406 1.3528 6.1703 2.2580 5.1164 6.2159 1.1667 2.4994 1.6293 2.2461 2.1410 1.2530 1.2396 1.0923 1.1453 3.7482 2.3497 1.8158 1.8061 1.7715 2.9865 3.7091 1.7790 1.8210 7.0388 2.2550 4.2016 1.9859 2.1070 2.2598 2.8524 1.9526 2.1956 3.2886 4.0904 10.1334 6.5435 5.0612 5.4987 5.4848 6.3823 6.3391 9.5762 1.0854 1.0870 1.0889 1.0890 1.0892 1.0930 1.0919 1.0955 1.0911 1.0939 1.0967 1.0972 1.0973
irintensity: 4160.4374 10.5292 4.1073 4.5307 1.2101 1.8710 9.9601 6.7618 0.4796 1.4679 1.2031 0.1358 8.2528 3.4144 11.2706 27.5890 4.0720 1.9987 0.7864 1.7520 2.8625 0.0130 0.9707 10.6068 36.8730 217.1252 32.5802 0.1385 0.0356 5.6548 1.6786 0.4727 1.1365 1.0801 0.9669 5.2515 1.5324 15.2701 152.9324 0.0829 0.0362 4.2329 5.4138 29.7447 9.0618 4.8270 6.0798 46.5206 42.3389 11.3556 0.6178 138.1302 34.2361 0.0261 2.1474 65.7203 7.8251 2.7536 8.9176 0.4907 1.7762 0.0331 0.1546 0.7628 1.5090 0.2298 3.0921 10.4179 1.0117 38.9835 26.3058 2.7679 5.8119 2.1863 5.2569 10.1349 0.6599 0.0469 9.3322 58.4123 2.6382 4.1739 1.8603 0.4846 0.1325 16.0216 257.0164 0.1478 2.6642 1.4939 0.8915 9.7601 53.0428 2.0370 24.8389 1439.8560 759.7589 14.0107 41.0599 778.5408 98.2084 3.3658 5.9371 19.6356 1.3084 11.2358 77.0383 2.0772 0.5020 11.3184 4.3016 2.5607 27.5812 0.2850 39.5435 6.5645 19.6151 5.1769 26.9619 20.6251
temp: 298.150 k
press: 1.00000 atm
elementType: 29 6 6 6 6 6 6 6 6 6 6 1 6 6 1 1 1 1 1 1 1 7 7 8 6 8 8 55 6 6 1 6 6 6 6 1 6 1 6 1 1 1
symmnumber: 1
zpe: 775679.4 jmol-1
zpe.correction: 0.295441 hartree
zpe.thermalcorrener: 0.321203 hartree
zpe.thermalcorrenthalpy: 0.322147 hartree
zpe.thermalcorrgfe: 0.233031 hartree
zpe.sumelectzpe: -1361.206169 hartree
zpe.sumelectthermal: -1361.180407 hartree
zpe.sumelectthermalent: -1361.179463 hartree
zpe.sumelectthermalfe: -1361.268579 hartree
dipole: -0.8375 1.8996 4.7967
dipole: 5.2267
quadrupole: -121.5505 -143.9912 -100.8875
quadrupole: 20.1986 74.1776 10.0295
quadrupole: 0.5926 -21.8482 21.2556 20.1986 74.1776 10.0295
hfenergy: -1361.5016098 hartree
pointgroup: C01 [X(C21H14Cs1Cu1N2O3)]
dipole: -0.3294879 0.7473709 1.8871675 debye
polarizability: 395.2920402|43.3085049|364.0114305|104.5883556|-33.9887649|258.4695984 unknown
InChI: InChI=1/C12H8N2.C8H6.CO3.Cs.Cu/c1-3-9-5-6-10-4-2-8-14-12(10)11(9)13-7-1;1-2-8-6-4-3-5-7-8;2-1(3)4;;/h1-8H;1,3-7H;;;/q-2;;-3;+2;+3/rC21H14CsCuN2O3/c1-2-6-16(7-3-1)12-13-23(28-21-22(26-21)27-21)24-14-4-8-17-10-11-18-9-5-15-25(23)20(18)19(17)24/h1-11,13-15H
charge 0 multiplicity 1
42 atoms
Cu -0.88757461 0.10521023 1.45450284
C  -3.27271003 -3.41186867 0.25498524
C  -4.20768748 -2.86710364 -0.60521583
C  -4.12192944 -1.49879336 -0.94180994
C  -3.06577634 -0.74926473 -0.36541479
C  -2.25551493 -2.58826503 0.76992505
C  -5.05513275 -0.84256351 -1.8140381
C  -2.96012104 0.66356976 -0.64411715
C  -3.90342614 1.2819662 -1.50504984
C  -4.9484598 0.48862192 -2.08777543
C  -3.77427487 2.6720404 -1.71369486
H  -4.47794586 3.18473264 -2.36461928
C  -2.75859225 3.36305721 -1.07749601
C  -1.8733099 2.65735347 -0.24083481
H  -5.85798241 -1.43240615 -2.24836137
H  -3.30886257 -4.45927091 0.53715527
H  -5.00753544 -3.47392742 -1.02132748
H  -1.50142851 -2.98206401 1.44495643
H  -5.66427446 0.97692801 -2.74407248
H  -2.63484331 4.4329597 -1.2123231
H  -1.0632771 3.16414582 0.27661779
N  -1.96700867 1.3496319 -0.02940056
N  -2.1486649 -1.29563319 0.47414406
O  1.03059639 0.14115371 1.6626277
C  1.72121632 0.47139918 2.72927302
O  1.08814616 0.92186462 3.79953588
O  2.97780854 0.36459565 2.73415152
Cs 3.4748132 1.22182428 5.52990819
C  -2.67207653 0.45923216 3.12711981
C  -1.49806882 0.65998763 3.45271788
H  -0.28423965 0.82310915 3.70936665
C  -4.01924139 0.2064472 2.72983883
C  -4.61613976 -1.05005861 2.96792284
C  -4.75907364 1.17964559 2.02435114
C  -5.90329934 -1.32109771 2.50971799
H  -4.05145907 -1.80715545 3.50325271
C  -6.0456548 0.90016136 1.56947097
H  -4.30171399 2.14365367 1.82452356
C  -6.62378164 -0.35031009 1.80705564
H  -6.34443341 -2.29712549 2.69557172
H  -6.59480568 1.65842537 1.0173135
H  -7.62540707 -0.56753786 1.4456808
