program: Gaussian 09
title: Title Card Required
version: ES64L-G09RevD.01
method: RB3LYP
basis: Gen
operation: Freq
keyword: #P
keyword: Geom=AllCheck
keyword: Guess=TCheck
keyword: SCRF=Check
keyword: GenChk
keyword: RB3LYP/ChkBas
keyword: Freq
converged: YES YES YES YES
title: Mulliken charges:
elementType: C C C C C C C C C C H C C H H H H H H H N N Cu C C C C O N H H H H H H H C C C C H C H C H H H Br C C C C C C H C H C H H H
charge: -0.153994 -0.164318 0.149861 0.209085 0.028925 -0.194152 0.230842 0.150727 -0.198173 -0.162850 0.167156 -0.156868 0.049575 0.155984 0.166435 0.164820 0.184000 0.156455 0.167623 0.196543 -0.426959 -0.412588 -0.141577 0.146339 0.550579 -0.521161 -0.494826 -0.481162 -0.658216 0.219998 0.214608 0.204288 0.233384 0.192733 0.208514 0.367760 0.307237 -0.193792 -0.170513 -0.151726 0.180296 -0.157032 0.177898 -0.135002 0.147075 0.145636 0.142361 -0.437284 -0.068609 -0.125658 0.017917 -0.159219 -0.157825 -0.144068 0.148024 -0.146636 0.150265 -0.138709 0.140683 0.139856 0.139438
chargesum: 0.00000
title: Mulliken charges with hydrogens summed into heavy atoms:
elementType: C C C C C C C C C C C C N N Cu C C C C O N C C C C C C Br C C C C C C C C
charge: 0.012440 0.000502 0.149861 0.209085 0.212925 -0.038168 0.230842 0.150727 -0.041717 0.004306 0.010754 0.246118 -0.426959 -0.412588 -0.141577 0.146339 0.550579 0.117733 0.139805 -0.481162 -0.290455 0.307237 -0.013496 0.007385 -0.004651 -0.011396 0.007359 -0.437284 -0.068609 -0.125658 0.017917 -0.011195 -0.007561 -0.003385 -0.006780 0.000728
polarizability: 5.74000163e+02 3.58057626e+01 5.19230884e+02 1.85925132e+01 -4.77869963e+01 5.49602919e+02
1716.lowfreq: -99.6019 -2.2197 -0.0006 -0.0004 -0.0001 4.5824 6.7479 13.3699 17.5861
frequency: -99.5921 12.5900 17.0868 23.7428 28.2328 35.4276 45.6004 52.6622 55.7295 60.9016 69.9548 80.2713 91.5411 96.0026 108.4115 113.1902 120.9891 129.0880 143.3865 151.2853 158.2639 164.8832 184.4528 202.8930 237.8130 243.8437 248.1798 250.6571 262.5412 273.6847 277.7118 284.8902 288.3361 338.8143 378.9876 399.2958 404.5379 416.6815 420.7921 421.4710 423.4873 445.5103 451.5135 478.0995 513.1950 522.5225 522.7761 527.4646 547.4341 557.8412 562.6990 566.3832 569.5036 620.6809 628.2257 633.1162 635.6778 643.6954 703.1112 710.5226 711.0637 731.2646 738.5543 748.0002 751.1282 779.7992 783.0909 786.6627 801.3075 820.6479 838.2993 845.2973 853.2877 861.7368 866.6295 876.3261 887.2629 897.8649 908.2050 926.8333 930.0022 967.4613 969.3699 974.5350 976.3364 981.2035 991.2102 1000.0868 1000.5503 1001.9210 1013.0525 1014.2826 1015.2012 1020.2659 1056.7705 1057.9430 1061.7163 1066.0038 1082.6281 1110.6828 1113.0763 1127.5348 1129.8572 1176.1102 1182.7044 1195.5467 1195.9913 1202.7253 1214.4342 1222.0133 1237.8055 1240.2781 1247.9988 1257.4949 1279.0103 1283.9613 1300.6540 1302.8965 1323.7204 1345.9341 1358.3753 1363.9369 1368.7725 1375.6822 1389.6338 1403.5835 1414.6391 1443.8034 1447.2047 1460.8918 1469.1406 1473.8353 1485.7394 1489.7620 1495.3569 1495.5765 1528.8699 1535.7766 1543.5196 1545.9533 1560.1627 1601.0790 1621.2386 1622.4303 1646.5396 1654.5593 1655.5139 1660.2729 1663.1114 1672.2561 1707.9800 2154.3331 2976.9090 2987.7123 3116.6098 3145.0979 3172.4972 3183.0428 3189.4549 3190.3305 3191.3809 3198.2177 3199.5125 3200.3497 3201.7376 3207.4516 3209.0685 3209.4464 3211.4552 3213.0460 3214.6883 3227.9393 3230.1195 3232.1238 3249.4721 3279.5004 3370.3736
redmass: 10.0238 6.3916 6.0912 6.7423 6.9959 6.4967 4.9242 4.4995 4.2255 6.7160 7.6389 5.1932 4.9602 8.4712 4.3197 5.2669 5.5071 5.6771 7.0285 15.0211 4.6217 2.9652 2.6546 2.0743 4.6134 4.0505 7.9146 5.7079 7.0040 5.9615 5.8665 1.2686 3.7914 3.3264 3.0244 5.7761 4.4831 3.0348 3.0906 4.5876 5.7005 2.9077 4.0755 6.5080 3.4469 7.5314 4.6862 3.1392 8.2257 3.7768 3.3341 7.1600 4.8849 3.9009 5.1717 5.7669 6.5645 8.1377 2.0323 5.8631 1.9520 6.8039 6.1356 3.6143 1.2510 1.7802 1.6073 1.2143 6.1334 1.3834 5.0636 6.1152 1.2601 1.2447 1.6411 6.4987 1.2836 3.5066 5.2252 1.4408 1.4211 2.3047 1.3830 1.3416 1.3426 1.3054 1.3465 1.2549 1.2551 1.3521 6.1425 1.3678 5.8043 1.3210 2.2240 5.5164 2.1768 1.6549 2.5931 1.6059 2.3139 1.5899 2.1465 1.2494 1.2329 1.1135 1.5896 1.6289 1.1442 1.1807 3.9057 3.1041 1.5603 1.7842 2.7701 3.0812 2.5538 2.1567 3.2731 3.7013 2.6137 1.7197 6.8597 2.0716 2.2108 1.1984 1.1814 4.3017 1.0664 1.8042 2.2618 1.0879 2.2303 2.0763 1.2142 2.3722 1.1197 2.1762 2.1983 3.2235 4.0500 2.1037 6.1523 5.0494 5.4695 5.3466 4.3230 6.1625 3.0284 6.3293 7.4275 11.9685 1.0606 1.0608 1.0715 1.0671 1.1048 1.0853 1.0862 1.0881 1.0870 1.0902 1.0907 1.0896 1.0916 1.0947 1.0965 1.1063 1.0910 1.0961 1.0982 1.0931 1.0972 1.0927 1.0935 1.0920 1.0817
irintensity: 11.4799 0.3993 0.4797 1.6272 0.0715 1.4749 1.9784 0.1659 0.3340 4.8477 4.6662 9.7080 0.3782 0.7301 11.6021 1.8387 7.8166 4.2682 7.2730 11.3645 0.7078 2.4037 16.4444 7.7675 3.6821 4.4165 9.7324 3.7981 5.6655 2.6393 7.2521 6.0421 7.2850 7.0632 75.3984 4.3573 15.0835 0.2578 0.0457 1.9486 4.3628 4.2478 0.9945 3.3885 0.7417 1.5806 1.8584 2.4375 0.7829 8.4199 0.2954 0.3786 24.6409 0.0906 6.9736 5.0923 0.1198 10.3376 18.9491 1.9937 21.7768 7.7253 8.4221 37.0481 10.7968 26.9898 92.3014 8.4899 14.4599 0.3661 30.0477 0.5034 0.4955 0.3228 65.6437 3.7298 3.6766 46.4014 0.6859 14.5034 4.3238 258.1586 5.4856 0.1238 1.1649 0.5042 0.5425 1.8984 0.2191 0.8407 0.4937 0.5827 4.0446 6.9880 8.0062 0.6521 26.3427 209.8696 0.4382 6.8719 0.5702 10.4969 12.1961 14.5617 1.0878 0.9198 16.3541 13.2634 0.9853 2.9956 32.2391 0.7880 3.1651 4.4176 97.4894 80.5536 127.8870 59.2006 0.0949 3.0303 18.8553 0.1030 3.3482 2.5254 6.4904 57.8786 29.4299 1.6684 6.5567 1.2122 55.4031 19.6423 2.9533 15.9368 18.0090 3.1725 28.9253 41.6331 46.0557 9.5196 56.3491 30.1530 13.9355 3.8207 6.2217 21.5362 31.7859 0.4756 19.4561 8.0046 292.1834 10.7086 8.4523 5.5851 26.7610 9.4288 9.6064 5.3737 1.3431 4.6847 0.6177 8.9025 21.9346 6.3096 25.6367 34.0105 34.1433 2.0622 4.9847 38.7462 24.4827 5.0172 24.5962 6.5538 7.1177 2.6302 370.3835
temp: 298.150 k
press: 1.00000 atm
elementType: 6 6 6 6 6 6 6 6 6 6 1 6 6 1 1 1 1 1 1 1 7 7 29 6 6 6 6 8 7 1 1 1 1 1 1 1 6 6 6 6 1 6 1 6 1 1 1 35 6 6 6 6 6 6 1 6 1 6 1 1 1
symmnumber: 1
zpe: 1249855.9 jmol-1
zpe.correction: 0.476045 hartree
zpe.thermalcorrener: 0.509006 hartree
zpe.thermalcorrenthalpy: 0.509950 hartree
zpe.thermalcorrgfe: 0.407544 hartree
zpe.sumelectzpe: -1608.077732 hartree
zpe.sumelectthermal: -1608.044771 hartree
zpe.sumelectthermalent: -1608.043826 hartree
zpe.sumelectthermalfe: -1608.146232 hartree
dipole: 1.7630 -3.4900 4.7239
dipole: 6.1322
quadrupole: -194.9399 -177.2733 -237.1566
quadrupole: -5.5074 -13.2159 -17.8060
quadrupole: 8.1834 25.8500 -34.0333 -5.5074 -13.2159 -17.8060
hfenergy: -1608.5537766 hartree
pointgroup: C01 [X(C30H25Br1Cu1N3O1)]
dipole: 0.6936267 -1.3730818 1.8585404 debye
polarizability: 574.0001628|35.8057626|519.230884|18.5925132|-47.7869963|549.6029192 unknown
InChI: InChI=1/C12H8N2.C10H12NO.C8H5.BrH.Cu/c1-3-9-5-6-10-4-2-8-14-12(10)11(9)13-7-1;1-8(2)10(12)11-9-6-4-3-5-7-9;1-2-8-6-4-3-5-7-8;;/h1-8H;3-7,11H,1-2H3;3-7H;1H;/q-1;;;;+2/p-1/rC20H13BrCuN2.C10H12NO/c21-22(13-12-16-6-2-1-3-7-16)24-15-5-9-18-11-10-17-8-4-14-23-19(17)20(18)24;1-8(2)10(12)11-9-6-4-3-5-7-9/h1-11,14-15H;3-7,11H,1-2H3
charge 0 multiplicity 1
61 atoms
C  -4.19384965 -5.92469752 -0.68396244
C  -2.92445959 -6.278701 -0.27549457
C  -1.8921841 -5.3140058 -0.30508343
C  -2.23479683 -4.00240005 -0.72884022
C  -4.42840089 -4.6009767 -1.10487555
C  -0.53687481 -5.61184753 0.06300437
C  -1.20256095 -2.98876867 -0.78735599
C  0.1319463 -3.32535539 -0.43817705
C  0.4360361 -4.6602111 -0.00741326
C  1.10776473 -2.30892154 -0.53898735
H  2.14032608 -2.53224511 -0.28340125
C  0.73712789 -1.04670705 -0.95992607
C  -0.61481348 -0.80456315 -1.26722783
H  -0.30028613 -6.62125831 0.38931627
H  -5.011064 -6.63839844 -0.68360848
H  -2.70303373 -7.28987617 0.05631459
H  -5.41190191 -4.30630043 -1.45175874
H  1.46215014 -4.89561205 0.26239543
H  1.4627396 -0.24488067 -1.05005301
H  -0.95329852 0.17673551 -1.58708892
N  -1.54983674 -1.74062237 -1.18204262
N  -3.4917065 -3.66177936 -1.10712718
Cu -3.67824865 -1.3493872 -1.31086285
C  -6.64755528 -0.85750128 -2.28453634
C  -6.91354698 -2.15699255 -1.56405526
C  -6.59470516 0.45124409 -1.58594973
C  -7.1042326 -0.84944198 -3.69617241
O  -7.4186237 -3.09272682 -2.19268185
N  -6.66758827 -2.17381515 -0.22038436
H  -6.05628742 0.44196535 -0.63792924
H  -6.16688134 1.21906072 -2.23542591
H  -7.64272143 0.7387877 -1.38068652
H  -6.89767746 -1.78703104 -4.20991623
H  -8.20457959 -0.7430444 -3.65211588
H  -6.70433656 0.00030453 -4.24935899
H  -6.01939325 -1.46322248 0.13115998
C  -6.89073184 -3.23959112 0.67087371
C  -6.23039394 -3.17456201 1.91266786
C  -7.72829123 -4.33388465 0.3860042
C  -6.39575487 -4.19117399 2.84671732
H  -5.58204505 -2.3315883 2.12606314
C  -7.8817051 -5.34346486 1.33654285
H  -8.23641975 -4.39121112 -0.56529906
C  -7.21983829 -5.28521105 2.56485646
H  -5.87616096 -4.12613256 3.79880409
H  -8.52986295 -6.18539041 1.10790033
H  -7.34709862 -6.07912639 3.29539243
Br -3.90726729 -1.03764356 -3.71544183
C  -4.11956837 -0.55907554 0.37349908
C  -4.3487022 -0.09314287 1.49454473
C  -4.65582495 0.38386533 2.80637397
C  -5.32546948 1.61053237 2.99981292
C  -4.31608492 -0.38156822 3.94323379
C  -5.64602473 2.04988579 4.28260954
H  -5.58813342 2.20956639 2.13248116
C  -4.6392825 0.06462034 5.22305006
H  -3.79363803 -1.32405929 3.80515748
C  -5.30622701 1.28041303 5.39948324
H  -6.16348617 2.99708424 4.4122677
H  -4.36956426 -0.538358 6.08648579
H  -5.55848437 1.62556186 6.39856192
