program: Gaussian 09
title: Title
version: ES64L-G09RevD.01
method: UB3LYP
basis: Gen
operation: Freq
keyword: #P
keyword: Geom=AllCheck
keyword: Guess=TCheck
keyword: SCRF=Check
keyword: GenChk
keyword: UB3LYP/ChkBas
keyword: Freq
converged: YES YES NO YES
polarizability: 5.64027590e+02 7.73245088e+01 6.37143609e+02 3.99143231e+00 5.00845400e+01 3.18984561e+02
1716.lowfreq: -80.1410 -7.0748 -4.6668 -0.0018 -0.0014 -0.0005 8.5535 17.4371 21.4988
frequency: -79.9496 16.4483 20.2200 26.5578 30.3922 35.5027 45.1039 51.6768 55.1973 62.8863 71.3135 87.7980 95.8170 104.7984 110.6339 116.5124 124.8257 132.3977 145.5208 148.9049 158.2525 172.8036 193.4083 214.0320 235.9728 247.6936 258.5899 264.9342 273.8534 284.1817 297.9830 313.3670 327.2091 339.6238 356.5121 371.5552 406.9258 420.0583 421.1458 422.4270 430.4325 432.1427 455.6353 490.7489 519.4119 521.9373 525.2846 534.0467 561.4251 563.0850 568.5342 571.0737 581.4747 620.4896 626.7062 635.7671 635.8853 652.2048 705.2725 709.1955 737.1039 740.3345 741.3565 743.3761 758.0525 778.9069 780.0835 787.0069 814.3899 816.9621 836.4496 844.7779 853.5869 859.5458 865.9314 880.3603 895.5975 916.6271 917.6346 932.2193 956.8467 969.5643 971.5876 974.5290 974.7913 983.1787 990.1591 993.0229 1000.6053 1007.6176 1012.5101 1013.9544 1014.6090 1018.9275 1056.2878 1057.3048 1059.6089 1085.0281 1092.9701 1113.5592 1118.4083 1120.9346 1133.8023 1177.3048 1185.4699 1186.5852 1195.4068 1196.2187 1216.7474 1219.5253 1222.8935 1244.0924 1247.7654 1250.7321 1260.0406 1290.1210 1296.6977 1303.3091 1327.4172 1353.7576 1357.3329 1366.5378 1369.7279 1372.4586 1388.8501 1417.2489 1429.1821 1455.2825 1459.6904 1469.4152 1483.7362 1485.9071 1486.6514 1496.0185 1500.2297 1503.8236 1527.5795 1538.3462 1544.1460 1546.3863 1564.9912 1598.8372 1624.0080 1628.2956 1643.7998 1655.8622 1658.4691 1658.8557 1665.5853 1674.2461 1754.4436 2215.8294 3008.1343 3027.7917 3102.0756 3107.8499 3167.0275 3175.5307 3182.2397 3182.7885 3190.4861 3191.9817 3199.2940 3199.4594 3201.8015 3207.1743 3209.9174 3210.8004 3211.3520 3215.8891 3218.2918 3233.4444 3234.1331 3237.3106 3254.3732 3275.5538 3453.6510
redmass: 9.9770 6.4540 5.6821 6.0901 4.7477 7.6303 5.4251 4.3682 8.1737 4.5827 7.1563 8.7072 6.7037 5.5128 7.1425 6.7998 5.5433 5.6280 7.1397 7.1755 4.7488 5.2200 3.6471 1.2066 3.0830 3.6855 4.2692 5.6211 4.1640 10.9900 5.1543 1.8407 2.1788 5.7613 2.8121 6.2576 5.6823 3.0849 3.0499 4.2153 5.4166 3.1833 4.0322 6.7047 3.4129 4.5969 3.0949 7.8411 3.1995 4.6081 7.0689 5.8568 5.6902 3.9256 5.4402 5.2736 6.2458 8.1494 2.1180 1.9164 6.1776 5.2696 4.7588 4.9696 1.4019 1.7180 1.6619 1.2022 6.2378 1.4576 4.9345 4.9289 1.2673 1.2481 1.6502 6.4341 3.1326 4.8042 1.5280 1.4061 1.4285 1.7598 1.4175 1.4142 1.3884 1.3331 1.3624 1.2480 1.2629 1.3533 1.3833 5.8723 5.9474 1.3310 2.2272 5.3536 2.1747 2.5385 1.5950 1.6095 2.2598 1.5684 2.1267 1.2558 2.5867 1.2319 1.1613 1.0979 1.1389 1.2081 2.9926 3.1112 3.1965 1.6652 1.8335 3.0889 1.8133 2.9336 3.2542 4.0064 2.3374 1.7259 4.6758 2.2871 2.4588 1.2120 1.2058 3.9227 1.9869 2.0950 1.0535 2.0790 2.2353 2.6548 1.1000 1.0998 1.0638 2.1887 3.2060 2.2719 4.2329 2.0904 5.0053 6.3095 5.4736 5.4218 4.5044 6.4478 3.2699 6.4014 7.5094 11.9975 1.0565 1.0504 1.0876 1.0764 1.1027 1.0986 1.0857 1.0853 1.0895 1.0886 1.0935 1.0876 1.0932 1.0899 1.0978 1.0906 1.0972 1.0964 1.0916 1.0942 1.0969 1.0930 1.0943 1.0920 1.0794
irintensity: 43.2126 0.6990 1.7392 2.6224 0.1456 2.8487 0.8638 0.6843 2.8663 1.4748 2.2541 5.5152 4.8281 0.8841 4.5086 1.3830 2.1791 1.9605 15.6840 22.2126 8.9330 7.4233 4.2791 0.9942 2.4410 1.2676 2.0252 0.6001 4.3903 13.4481 5.5243 9.7295 13.6203 8.9376 8.6586 11.4401 9.4010 0.0988 0.6632 0.4693 14.4727 1.9095 0.4039 1.4430 0.1302 1.6914 3.2564 4.1036 0.6191 4.7888 1.3015 7.2288 18.1953 1.6018 0.3280 0.6016 0.2824 10.1571 11.5307 29.8502 11.5432 20.6346 25.2806 19.9473 23.4182 115.1840 50.7214 8.9050 23.8793 0.7205 3.2003 1.4359 3.0905 0.5947 68.5391 15.9789 13.2203 0.8544 17.1408 3.6269 12.0273 17.5043 4.1283 3.0256 4.3322 1.3912 0.6709 2.0081 0.4032 1.3690 0.3335 0.5670 0.5091 16.9652 8.5888 0.7133 4.0911 4.1245 158.2730 5.4723 0.3636 9.7945 32.7451 13.9856 102.2902 1.7670 11.1759 0.4114 0.1792 5.9035 25.6047 0.4773 21.8364 3.7334 7.3286 107.4504 5.2307 50.1911 0.0761 7.0059 121.5620 0.4091 8.8951 7.3098 18.7669 12.4195 10.5072 8.6513 11.7377 59.8700 3.8414 42.9073 6.0375 2.1668 0.6555 14.1141 41.3194 32.3560 9.1355 131.6706 85.0810 181.5063 2.1593 15.9895 18.5927 4.7465 121.5174 1.3511 12.0944 7.7581 214.0181 29.2872 9.1478 25.0580 12.9008 10.7512 24.6700 12.2752 0.1346 2.7936 10.9791 8.0985 19.6618 0.2916 39.8177 7.4456 36.0178 3.0578 42.8951 25.9461 1.9689 5.5132 13.9872 2.6729 4.0044 0.9862 211.5505
temp: 298.150 k
press: 1.00000 atm
elementType: 29 6 6 6 6 6 1 6 6 6 1 6 6 6 1 1 6 1 1 1 1 7 7 35 6 6 6 6 6 6 1 6 1 6 1 1 1 6 6 6 6 8 7 1 1 1 1 1 1 1 6 6 6 6 1 6 1 6 1 1 1
symmnumber: 1
zpe: 1253914.4 jmol-1
zpe.correction: 0.477591 hartree
zpe.thermalcorrener: 0.510202 hartree
zpe.thermalcorrenthalpy: 0.511146 hartree
zpe.thermalcorrgfe: 0.410218 hartree
zpe.sumelectzpe: -1608.095390 hartree
zpe.sumelectthermal: -1608.062779 hartree
zpe.sumelectthermalent: -1608.061835 hartree
zpe.sumelectthermalfe: -1608.162763 hartree
dipole: 0.6195 -14.3838 -5.1778
dipole: 15.2999
quadrupole: -196.0407 -159.3717 -234.5033
quadrupole: 15.1133 20.1130 20.7768
quadrupole: 0.5978 37.2669 -37.8647 15.1133 20.1130 20.7768
hfenergy: -1608.5729812 hartree
pointgroup: C01 [X(C30H25Br1Cu1N3O1)]
dipole: 0.2437215 -5.6590035 -2.0371005 debye
polarizability: 564.0275904|77.3245088|637.143609|3.9914323|50.08454|318.9845609 unknown
InChI: InChI=1/C12H8N2.C10H12NO.C8H5.BrH.Cu/c1-3-9-5-6-10-4-2-8-14-12(10)11(9)13-7-1;1-8(2)10(12)11-9-6-4-3-5-7-9;1-2-8-6-4-3-5-7-8;;/h1-8H;3-7,11H,1-2H3;3-7H;1H;/q-1;;;;+2/p-1/rC30H25BrCuN3O/c1-30(2,29(36)34-26-15-7-4-8-16-26)32(31,20-19-23-11-5-3-6-12-23)35-22-10-14-25-18-17-24-13-9-21-33-27(24)28(25)35/h3-18,21-22,34H,1-2H3
charge 0 multiplicity 1
61 atoms
Cu -0.9318119 -0.70423756 -0.37924447
C  -0.1962968 -3.60122448 -0.52966527
C  1.74868425 -2.47565652 0.0040507
C  -1.61652037 -3.52234797 -0.74608965
C  0.46830677 -4.84872628 -0.61612609
C  2.50225569 -3.66397917 -0.07138256
H  2.20211243 -1.51868069 0.24418566
C  -2.34783315 -4.71073385 -0.9921154
C  -0.29389238 -6.0271558 -0.91608686
C  1.86213796 -4.84923589 -0.38001386
H  3.56983559 -3.63425722 0.11964651
C  -3.75016972 -4.59756633 -1.11467075
C  -1.64540781 -5.9604928 -1.08663188
C  -3.53639895 -2.23170824 -0.74424994
H  0.22596794 -6.97834773 -0.98706915
H  2.41456598 -5.78314524 -0.43800064
C  -4.34430071 -3.35952907 -0.96810431
H  -4.34636434 -5.48595443 -1.30427603
H  -2.22035366 -6.85883078 -1.29308809
H  -3.968289 -1.24792385 -0.61177119
H  -5.42026742 -3.23696458 -1.02654415
N  0.44214934 -2.45200663 -0.2150915
N  -2.2092178 -2.29752253 -0.67192262
Br -2.56980353 0.34337676 1.40189921
C  0.45652349 0.51281894 -0.21253082
C  1.41187202 1.26846984 -0.08622805
C  2.47075529 2.21256969 0.07190908
C  2.19552765 3.5142929 0.54162066
C  3.80008962 1.87787177 -0.25760343
C  3.22132549 4.44703749 0.67130363
H  1.17494602 3.78380698 0.79022128
C  4.82075777 2.81658697 -0.12136546
H  4.02015186 0.87967834 -0.62618577
C  4.53647812 4.10429872 0.34279752
H  2.98744987 5.44786211 1.02471173
H  5.84049656 2.54405882 -0.3815919
H  5.33374403 4.83606511 0.44405475
C  -1.13064447 0.42440083 -2.33714891
C  -0.80069344 1.90206319 -2.20759366
C  -2.60017526 0.19613127 -2.61994253
C  -0.17806603 -0.35254393 -3.2101295
O  -0.05271991 2.4258977 -3.02807045
N  -1.47924054 2.56604182 -1.21771272
H  -2.8670718 0.79644861 -3.50557302
H  -2.81301022 -0.84854281 -2.85197697
H  -3.24705069 0.53126499 -1.80457603
H  0.8595097 -0.15865144 -2.93698892
H  -0.3790582 -1.42664616 -3.14357561
H  -0.31866406 -0.04872365 -4.25843096
H  -1.90835629 1.96070087 -0.51774655
C  -1.20211684 3.86436261 -0.74128092
C  -1.57774847 4.15173475 0.58323244
C  -0.56323635 4.85097925 -1.50917343
C  -1.30416228 5.4011625 1.13414993
H  -2.05635975 3.37993273 1.18062978
C  -0.29218147 6.09602439 -0.93940772
H  -0.26408121 4.63029173 -2.52363582
C  -0.65428937 6.38185444 0.37842243
H  -1.59218215 5.60275624 2.16260503
H  0.21348544 6.84850869 -1.53921806
H  -0.43549461 7.35420972 0.81124573
