program: Gaussian 09
title: Title Card Required
version: ES64L-G09RevD.01
method: RB3LYP
basis: Gen
operation: Freq
keyword: #P
keyword: Geom=AllCheck
keyword: Guess=TCheck
keyword: SCRF=Check
keyword: GenChk
keyword: RB3LYP/ChkBas
keyword: Freq
converged: YES YES YES YES
title: Mulliken charges:
elementType: C C C C C C C C C C H C C H H H H H H H N N Cu Br C C C C C C H C H C H H H C C C C O N H H H H H H H C C C C H C H C H H H
charge: -0.153530 -0.162631 0.153086 0.211031 0.026046 -0.191804 0.244509 0.155850 -0.194281 -0.161111 0.175174 -0.155147 0.083123 0.162112 0.171843 0.172423 0.199878 0.163219 0.178566 0.204862 -0.462999 -0.412853 -0.177063 -0.533908 0.101097 -0.162705 0.026273 -0.162311 -0.153308 -0.143478 0.143327 -0.144952 0.163250 -0.137516 0.140533 0.144207 0.141039 0.027895 0.577876 -0.465126 -0.476596 -0.478436 -0.660406 0.214408 0.198990 0.175437 0.188875 0.167029 0.187192 0.403695 0.323708 -0.196175 -0.182859 -0.145325 0.172702 -0.155228 0.176342 -0.137636 0.149008 0.142680 0.140100
chargesum: 0.00000
title: Mulliken charges with hydrogens summed into heavy atoms:
elementType: C C C C C C C C C C C C N N Cu Br C C C C C C C C C C C C O N C C C C C C
charge: 0.018313 0.009792 0.153086 0.211031 0.225924 -0.029692 0.244509 0.155850 -0.031062 0.014063 0.023419 0.287986 -0.462999 -0.412853 -0.177063 -0.533908 0.101097 -0.162705 0.026273 -0.018983 0.009941 -0.002945 -0.000745 0.003523 0.027895 0.577876 0.123708 0.066500 -0.478436 -0.256711 0.323708 -0.023473 -0.006518 0.003683 -0.012548 0.002465
polarizability: 3.36983501e+02 -2.43654493e+01 5.34865765e+02 3.81935701e+01 5.24942708e+01 6.47046112e+02
1716.lowfreq: -123.0388 -4.8659 0.0004 0.0004 0.0007 6.1176 7.7448 14.2051 22.7221
frequency: -123.0328 9.8031 22.0953 24.6643 26.0246 30.1929 33.8333 45.5188 47.4748 48.9384 84.4436 86.3647 98.6630 104.2662 108.1057 123.4285 137.9618 143.9131 153.1546 171.7785 179.1659 186.6421 215.6454 225.9678 244.1443 263.1718 270.9495 277.5155 286.3961 293.3341 298.9598 310.9874 350.3183 362.0515 365.7058 385.9178 413.0222 414.6310 419.4308 425.4549 430.2936 454.1586 458.1757 488.6506 517.9948 522.3581 524.2002 529.1873 553.4987 567.3270 570.0355 586.0550 590.7259 621.3919 631.5632 635.2932 640.9404 653.7255 663.2889 705.0451 705.7255 737.0678 742.5483 743.8895 759.2821 773.7031 775.1908 785.3640 817.8075 819.8124 835.3344 846.8283 847.9661 853.2507 864.5115 881.5355 893.8339 917.3620 918.7994 923.9353 964.8992 968.5312 968.7695 971.3967 979.2084 986.4502 986.9576 994.7050 996.7730 1004.4220 1007.5954 1012.5516 1014.9652 1029.6305 1056.1478 1057.6140 1062.9285 1085.0403 1110.2952 1114.2376 1120.5535 1127.8916 1132.9100 1177.9423 1179.1181 1183.0261 1196.5585 1202.1541 1205.6910 1212.6525 1223.0582 1243.0381 1248.6363 1252.2280 1257.9705 1283.9445 1288.7663 1300.7076 1325.2917 1351.4958 1359.0460 1363.8265 1370.2574 1374.6121 1390.0807 1429.2402 1446.3394 1452.7644 1458.4777 1469.3689 1485.9385 1488.7092 1496.7626 1500.4325 1503.4880 1520.1226 1527.5548 1536.6029 1545.0579 1547.4518 1563.9959 1592.8689 1622.6710 1629.7266 1646.8565 1655.1812 1657.8088 1660.4703 1663.2276 1672.9228 1740.5552 2211.9779 3019.5036 3041.5905 3127.0965 3135.2495 3180.5519 3183.4151 3183.6559 3188.3604 3191.0480 3193.5123 3197.8226 3201.1511 3201.3717 3204.3080 3205.1465 3208.0655 3208.9675 3214.6466 3216.3606 3217.3227 3229.1499 3234.4535 3272.1464 3273.2217 3570.9582
redmass: 7.3176 6.1137 6.3582 3.7992 6.2481 5.8034 6.4463 4.6928 6.8133 8.3174 7.0531 6.4786 5.8422 5.8162 7.1152 6.4438 6.3722 6.0727 11.7458 6.8983 4.8263 4.9478 6.0339 4.0967 3.5813 1.6321 4.0411 8.9896 3.3066 2.8567 5.1752 5.6429 2.3482 3.6565 1.8500 2.8642 3.4413 4.5867 3.0963 4.6182 5.6771 2.6668 3.9856 6.7553 3.4424 4.1201 3.2621 7.8061 3.9568 3.4388 6.0627 6.8440 5.5121 3.9068 5.5149 6.5964 3.4689 7.8274 1.3159 1.9362 2.1737 6.2411 4.0500 5.1722 4.7709 1.7403 1.8012 1.1999 1.3706 6.3236 5.2199 1.3360 5.2132 1.2501 1.6577 6.4218 4.7541 1.5420 4.3439 1.4211 2.3580 1.3479 1.3488 1.4005 1.3429 1.4946 1.3932 1.2494 1.2590 1.3526 1.3643 6.1385 6.0704 1.2730 2.2221 5.0018 2.2124 2.6373 1.5941 1.5594 2.2881 1.5715 2.0903 1.2584 2.9565 1.2324 1.0972 1.1367 2.5113 1.1391 1.1492 3.1114 1.6069 3.6686 1.7847 3.5427 2.4354 1.8183 3.0850 3.8589 2.4527 1.7804 5.3630 2.1879 2.4068 1.2043 1.1920 3.9744 1.9556 2.2363 2.2385 2.0492 2.7704 1.0674 1.0575 1.0505 1.0628 2.2030 3.2713 2.2506 4.2397 1.9461 5.0579 6.3162 5.4073 5.4024 3.9200 6.3548 5.0262 6.4809 7.6489 11.9955 1.0561 1.0525 1.0839 1.0773 1.1052 1.0857 1.1001 1.0861 1.0880 1.0893 1.0873 1.0893 1.0924 1.0930 1.0922 1.0905 1.0949 1.0964 1.0976 1.0976 1.0967 1.0946 1.0931 1.0921 1.0775
irintensity: 20.8063 0.0252 1.6088 0.0319 2.9362 0.3961 0.6565 1.3278 2.3793 1.7043 3.8136 2.9551 1.4947 1.5439 7.2944 1.1032 2.6530 1.8013 17.9377 13.2079 14.1976 0.8017 9.3854 3.1263 2.0800 4.0052 0.3231 2.9710 3.2179 5.5104 14.6156 3.4576 5.4328 8.1899 1.8120 4.9408 0.8784 3.3078 0.2095 2.9000 6.6518 9.0351 0.1219 0.7076 0.4232 2.5955 6.2958 2.5728 4.2604 0.1545 0.1231 5.5532 31.2264 0.2211 4.8749 0.0407 18.8251 12.6818 75.7991 13.3961 48.2004 10.5997 28.9898 12.3339 12.2748 52.2395 52.2630 7.7656 0.3133 11.6119 0.4383 0.5529 0.2235 0.0542 63.1584 14.1678 10.6044 11.9255 0.2416 3.8423 34.4030 0.1407 0.8398 2.5496 1.4306 10.2140 3.7083 2.3565 0.1560 1.7806 0.0932 0.0140 0.2463 5.6008 8.1875 0.6108 3.1806 0.3227 8.3882 146.0440 2.7194 5.3234 24.5217 17.4855 64.1804 5.5065 0.0217 3.5312 38.0407 0.4895 3.1909 0.6304 8.9180 21.3475 3.9894 29.3930 135.2759 1.4450 0.1792 4.1141 122.2698 0.2251 3.8196 4.7914 6.1885 6.8673 7.7843 4.6232 4.8304 60.4579 3.5909 79.1848 1.4713 2.7467 5.6476 15.6108 10.4387 47.9467 16.7278 130.4458 98.7273 313.8497 2.7687 21.1247 16.4422 34.7564 101.4863 2.6901 23.4799 9.7143 245.2242 21.2011 27.6436 46.4421 9.0002 19.1755 14.5732 9.3427 12.0785 6.2230 3.5699 8.0973 0.1359 6.0221 28.4159 25.5696 2.4350 5.2883 35.6922 27.0081 20.1726 27.7895 15.5659 5.9193 1.6426 1.1584 45.2083
temp: 298.150 k
press: 1.00000 atm
elementType: 6 6 6 6 6 6 6 6 6 6 1 6 6 1 1 1 1 1 1 1 7 7 29 35 6 6 6 6 6 6 1 6 1 6 1 1 1 6 6 6 6 8 7 1 1 1 1 1 1 1 6 6 6 6 1 6 1 6 1 1 1
symmnumber: 1
zpe: 1256365.6 jmol-1
zpe.correction: 0.478524 hartree
zpe.thermalcorrener: 0.510842 hartree
zpe.thermalcorrenthalpy: 0.511786 hartree
zpe.thermalcorrgfe: 0.410490 hartree
zpe.sumelectzpe: -1608.098394 hartree
zpe.sumelectthermal: -1608.066076 hartree
zpe.sumelectthermalent: -1608.065132 hartree
zpe.sumelectthermalfe: -1608.166428 hartree
dipole: 5.3399 -7.1994 3.3985
dipole: 9.5862
quadrupole: -290.0687 -172.8368 -180.4780
quadrupole: 29.4306 -15.3324 -7.3035
quadrupole: -75.6075 41.6244 33.9832 29.4306 -15.3324 -7.3035
hfenergy: -1608.5769179 hartree
pointgroup: C01 [X(C30H25Br1Cu1N3O1)]
dipole: 2.1008703 -2.8324748 1.3370599 debye
polarizability: 336.9835011|-24.3654493|534.8657647|38.1935701|52.4942708|647.0461115 unknown
InChI: InChI=1/C12H8N2.C10H12NO.C8H5.BrH.Cu/c1-3-9-5-6-10-4-2-8-14-12(10)11(9)13-7-1;1-8(2)10(12)11-9-6-4-3-5-7-9;1-2-8-6-4-3-5-7-8;;/h1-8H;3-7,11H,1-2H3;3-7H;1H;/q-1;;;;+2/p-1/rC30H25BrCuN3O/c1-30(2,29(36)34-26-15-7-4-8-16-26)32(31,20-19-23-11-5-3-6-12-23)35-22-10-14-25-18-17-24-13-9-21-33-27(24)28(25)35/h3-18,21-22,34H,1-2H3
charge 0 multiplicity 1
61 atoms
C  -4.70187289 -4.79242236 -0.74150346
C  -4.61823969 -5.21399055 0.57195884
C  -4.41522552 -4.26492848 1.59999368
C  -4.29209112 -2.90832312 1.20779779
C  -4.5781369 -3.4177456 -1.02624057
C  -4.34140113 -4.60380041 2.99264725
C  -4.09506368 -1.88627295 2.2066493
C  -4.05606674 -2.25136547 3.57482763
C  -4.17422564 -3.63598217 3.9386321
C  -3.90992028 -1.21421516 4.52270308
H  -3.87609105 -1.45681905 5.58133196
C  -3.82792372 0.09397017 4.09014763
C  -3.86816855 0.36292929 2.71164969
H  -4.43398885 -5.64792257 3.27875835
H  -4.8656337 -5.49771827 -1.54966782
H  -4.71488476 -6.2659112 0.82745426
H  -4.64726286 -3.03556592 -2.04143792
H  -4.13252617 -3.89455127 4.99311661
H  -3.7314382 0.91808975 4.78843914
H  -3.8152743 1.37912805 2.34481989
N  -3.97548809 -0.59406521 1.79557124
N  -4.37541971 -2.51207308 -0.081894
Cu -4.20045176 -0.27210465 -0.21593312
Br -6.50022547 0.68149612 0.14266991
C  -4.08825674 -0.05786183 -2.02768227
C  -4.26726273 -0.06630091 -3.23898669
C  -4.49594885 -0.05788041 -4.64560189
C  -3.91070826 -1.03693446 -5.4762385
C  -5.30543401 0.93484561 -5.2373087
C  -4.12851394 -1.01982802 -6.85205959
H  -3.28585628 -1.80501127 -5.02884399
C  -5.51505388 0.94600611 -6.61434513
H  -5.76621159 1.68652092 -4.6032443
C  -4.92944078 -0.02905197 -7.42760678
H  -3.6708338 -1.78162027 -7.47805626
H  -6.14172912 1.71716581 -7.05478769
H  -5.09762855 -0.01793743 -8.50112662
C  -2.13703133 0.29090651 -0.80916148
C  -2.12593843 1.37073294 0.26447816
C  -1.46166205 -1.00345227 -0.40052993
C  -1.54192876 0.8444194 -2.1033671
O  -1.37693757 1.27552378 1.2353304
N  -2.95475135 2.43607507 0.02359135
H  -1.73076668 -1.31895083 0.60727992
H  -1.72255206 -1.79490577 -1.10740716
H  -0.37151776 -0.86621852 -0.42914482
H  -2.07088112 1.71812309 -2.48584082
H  -0.50745749 1.14705969 -1.87534385
H  -1.51175098 0.08436625 -2.88544734
H  -3.60318223 2.31843217 -0.74823368
C  -3.16769977 3.58881464 0.80940001
C  -4.26436698 4.39836093 0.46769454
C  -2.3464064 3.95094344 1.88956949
C  -4.53635395 5.55329814 1.19508885
H  -4.90820759 4.10903093 -0.35919084
C  -2.63614872 5.11176476 2.60973498
H  -1.50259834 3.33036693 2.1550332
C  -3.72411335 5.91819493 2.27264513
H  -5.39090389 6.16531849 0.91999623
H  -1.99504809 5.38528265 3.44387327
H  -3.93861182 6.81872189 2.84110549
