program: Gaussian 09
title: 000075178
version: EM64L-G09RevD.01
frameworkgroup: C1[X(C9H11Cl3NO3P)]
method: RPBEPBE
basis: SDD
operation: Freq
keyword: #p
keyword: freq=noraman
keyword: PBEPBE/SDD
title: #p freq=noraman PBEPBE/SDD
converged: YES YES NO NO
title: Mulliken charges:
elementType: Cl Cl Cl P O O O N C C C C C C C C C H H H H H H H H H H H
charge: -0.031328 0.011239 0.008821 1.396426 -0.539115 -0.471478 -0.583634 -0.754652 -0.298497 0.536673 -0.631437 -0.320789 -0.291775 -0.057975 -0.192924 -0.095627 -0.491762 0.353483 0.225606 0.253651 0.229412 0.206919 0.222232 0.306444 0.285144 0.248937 0.217776 0.258230
chargesum: 0.00000
title: Mulliken charges with hydrogens summed into heavy atoms:
elementType: Cl Cl Cl P O O O N C C C C C C C C C
charge: -0.031328 0.011239 0.008821 1.396426 -0.539115 -0.471478 -0.583634 -0.401169 0.180760 0.536673 0.027126 -0.320789 0.014669 -0.057975 0.092220 -0.095627 0.233181
polarizability: 2.26578501e+02 1.59537498e+01 1.66777126e+02 -1.79114163e+01 3.75735909e+00 1.14297487e+02
1716.lowfreq: -6.7215 -0.0029 -0.0018 0.0028 4.4490 8.0997 14.0321 19.0954 36.5035
frequency: 13.3792 18.9170 36.3208 39.7630 49.8324 69.4079 80.2125 130.7446 137.6752 149.4877 168.0901 179.4701 190.3477 193.6303 212.2686 239.6771 250.5581 296.9312 309.5112 321.3200 342.4395 369.3960 396.8478 409.2696 425.7826 450.5997 495.0578 502.2591 520.5651 585.7243 624.5397 635.3748 657.5640 689.3900 734.5152 748.5750 808.1078 851.5774 878.8676 891.0805 926.2765 967.3906 1030.7819 1054.6528 1084.4433 1108.3372 1110.2152 1115.4417 1130.2115 1135.0219 1221.4705 1233.2827 1273.6597 1322.7632 1346.1671 1362.2222 1387.7549 1402.8036 1424.0117 1441.2345 1464.2312 1469.2594 1471.4239 1473.0103 1482.3693 1553.7193 1578.6446 2981.2946 2981.8425 2999.8310 3058.2450 3081.6324 3088.6741 3093.4020 3133.6615 3179.1085 3182.6113 3529.4433
redmass: 6.3095 6.6323 3.0507 4.7375 3.4209 7.7062 4.1444 6.9040 2.1391 5.5225 1.5185 8.8877 4.6052 8.4681 3.9177 3.4086 2.0199 8.2484 21.0692 6.7965 10.1714 4.5903 4.2254 3.4441 7.2225 3.3860 1.6998 8.2568 4.6525 7.6700 9.0709 7.2364 7.8369 3.5815 10.3361 2.4091 1.4846 1.4612 1.4619 8.6852 2.3888 10.6218 6.4024 4.7616 2.5353 1.8621 1.2770 3.1275 1.4661 1.5307 3.4887 1.4119 1.1472 8.5760 1.2479 10.9245 1.2299 1.2392 1.1235 3.0693 1.0509 1.0461 1.0477 1.0546 1.0708 9.5005 8.3699 1.0328 1.0347 1.0631 1.1011 1.0990 1.1012 1.1023 1.1041 1.0930 1.0934 1.0769
irintensity: 1.0864 4.4063 1.5530 1.2055 2.8076 0.1066 1.7605 0.1123 1.0551 0.3009 1.7577 0.4254 3.3301 0.3318 0.9090 4.4671 4.8619 8.5656 1.9351 36.7195 16.7973 12.6490 8.6793 9.3954 7.5360 15.1306 62.3988 21.6359 101.5288 50.9086 10.2013 84.9823 117.4795 2.3380 231.5297 96.8578 11.3800 3.9952 36.9153 90.2054 21.4725 163.7422 110.5081 66.6358 28.2776 101.9410 5.3495 109.1561 27.9471 16.4957 72.2970 13.0314 22.2526 62.3865 1.8008 14.1771 32.0291 41.5110 5.1281 282.1351 11.9448 10.2411 12.7581 3.5004 18.1922 2.1473 10.7866 19.0310 47.9719 27.1285 1.5641 39.3473 28.2714 35.5513 13.6832 5.1983 0.2860 33.4243
temp: 298.150 k
press: 1.00000 atm
elementType: 17 17 17 15 8 8 8 7 6 6 6 6 6 6 6 6 6 1 1 1 1 1 1 1 1 1 1 1
symmnumber: 1
zpe: 502345.6 jmol-1
zpe.correction: 0.191333 hartree
zpe.thermalcorrener: 0.211314 hartree
zpe.thermalcorrenthalpy: 0.212258 hartree
zpe.thermalcorrgfe: 0.138701 hartree
zpe.sumelectzpe: -2350.065569 hartree
zpe.sumelectthermal: -2350.045589 hartree
zpe.sumelectthermalent: -2350.044645 hartree
zpe.sumelectthermalfe: -2350.118201 hartree
dipole: 2.7370 4.7026 1.5495
dipole: 5.6575
quadrupole: -123.3025 -135.8357 -123.2426
quadrupole: 8.9515 3.9195 -1.1165
quadrupole: 4.1578 -8.3754 4.2177 8.9515 3.9195 -1.1165
hfenergy: -2350.2569023 hartree
pointgroup: C01 [X(C9H11Cl3N1O3P1)]
dipole: -0.7174577 -0.6890235 1.9911765 debye
polarizability: 219.1902471|29.1575743|134.3471148|-10.4146634|-28.5729278|154.1157526 unknown
InChI: InChI=1S/C9H11Cl3NO3P/c1-3-13-17(14,15-2)16-9-5-7(11)6(10)4-8(9)12/h4-5,13H,3H2,1-2H3
charge 0 multiplicity 1
28 atoms
Cl 0.489834 -1.831617 2.083349
Cl 3.407807 1.680535 -2.440299
Cl 5.038088 0.760202 0.266476
P  -2.066994 0.163254 -0.623604
O  -0.680213 -0.959508 -0.570115
O  -3.241762 -1.01844 -1.051242
O  -2.041101 1.365508 -1.652496
N  -2.138164 0.616142 1.026883
C  -2.711174 1.901217 1.493008
C  0.623984 -0.495645 -0.372612
C  -4.093623 1.744792 2.156326
C  1.332518 -0.865544 0.795668
C  1.27449 0.289303 -1.352502
C  2.614012 0.679454 -1.164322
C  2.672966 -0.48935 0.985155
C  3.315525 0.287135 -0.002228
C  -3.40597 -2.235741 -0.222112
H  -1.782129 -0.042922 1.724636
H  -1.992909 2.361504 2.197739
H  -2.774809 2.571851 0.6172
H  -4.826347 1.329244 1.442263
H  -4.04343 1.074078 3.033705
H  -4.464669 2.727777 2.500906
H  0.726353 0.58776 -2.250533
H  3.213374 -0.785947 1.887318
H  -4.230723 -2.782455 -0.702104
H  -3.684403 -1.972497 0.816138
H  -2.482833 -2.839091 -0.233698
