program: Orca
programVersion: 6.1.1
elementType: P C C C C C C C C C C C C H C H C H C H C H C C C H C C C C C C C H C C C C H C H C H C H C H C C C H H O O H C H O O O O O O C C C C C H H H C C C C H H H C C C H H H Au Au P H H H C C C C C C H H H H H H C C C C C C H H H C C C H H N H S C O O C H H H H H H O C O C C C C H H H H C C H H H H H H H H H H H H C C C C C H H H H H H H H H H H H H H H H H H H H H H H H H H H H H H H H H H H
elementType: Au
charge: 2
multiplicity: 1
keywords: B97-3C Opt PAL32 CPCM(acetonitrile) VeryTightSCF
keywords: Freq
formula: C79H97Au2NO12P2S
InChI: InChI=1/C62H76O8P2.C17H21NO4S.2Au/c1-35-25-39(26-36(2)53(35)63-17)71(42-31-45(61(11,12)13)56(66-20)46(32-42)62(14,15)16)49-23-21-47-57(69-33-67-47)51(49)52-50(24-22-48-58(52)70-34-68-48)72(40-27-37(3)54(64-18)43(29-40)59(5,6)7)41-28-38(4)55(65-19)44(30-41)60(8,9)10;1-18(23(3,20)21)11-7-10-17(16(19)22-2)12-15(13-17)14-8-5-4-6-9-14;;/h21-32H,33-34H2,1-20H3;4-9,11-12H,10,13H2,1-3H3;;/q;-1;;+1/rC79H97Au2NO12P2S/c1-47-33-54(34-48(2)68(47)85-18)96(57-39-60(77(11,12)13)71(88-21)61(40-57)78(14,15)16)65-32-30-63-73(93-46-91-63)67(65)66-64(31-29-62-72(66)92-45-90-62)95(55-35-49(3)69(86-19)58(37-55)75(5,6)7,56-36-50(4)70(87-20)59(38-56)76(8,9)10)80-53(44-82(17)97(23,83)84)43-79(74(89-22)94-81(80)96)41-52(42-79)51-27-25-24-26-28-51/h24-41,44,53H,42-43,45-46H2,1-23H3
194 atoms
P  3.604996 0.294315 1.147001
C  2.700728 0.802701 -0.36177
C  5.131914 -0.586285 0.636812
C  4.190375 1.802178 1.954251
C  1.762678 1.873876 -0.32785
C  2.885234 0.07239 -1.531594
C  5.025811 -1.865038 0.085014
C  6.392175 -0.099286 0.947782
C  4.958553 2.690976 1.213985
C  3.972328 2.038172 3.306644
C  1.473344 2.719119 0.8547
C  1.128518 2.157998 -1.518882
C  2.180728 0.347953 -2.706279
H  3.604262 -0.72929 -1.555535
C  6.136695 -2.631249 -0.2478
H  4.042591 -2.275759 -0.073328
C  7.536936 -0.840656 0.676321
H  6.507248 0.849343 1.448018
C  5.570409 3.774988 1.822309
H  5.091265 2.544226 0.150271
C  4.540173 3.130206 3.962558
H  3.345478 1.347603 3.847811
C  0.579915 2.353611 1.894893
C  2.009798 3.983291 0.94618
C  1.306516 1.404217 -2.672009
H  2.336053 -0.236291 -3.60077
C  7.404915 -2.081373 0.038353
C  5.388505 3.961416 3.201718
C  0.355348 3.201844 2.974917
C  1.775321 4.826522 2.026711
C  -1.527695 0.806887 3.153524
C  -1.734971 1.666638 0.379976
C  0.962904 4.454396 3.067696
H  -0.340058 2.911433 3.746427
C  -0.908307 0.318583 4.293846
C  -2.871884 1.146443 3.192908
C  -2.19176 2.976039 0.506721
C  -2.150207 0.891796 -0.69456
H  0.765186 5.11089 3.900509
C  -1.584143 0.226166 5.51151
H  0.125478 0.011721 4.227814
C  -3.593851 1.121341 4.378414
H  -3.351672 1.461516 2.28422
C  -3.082867 3.510184 -0.411582
H  -1.853644 3.593182 1.32821
C  -3.032771 1.395381 -1.644981
H  -1.764803 -0.112872 -0.81649
C  -2.899392 0.744909 5.551263
C  -3.500235 2.702855 -1.478079
C  -0.09273 3.085979 -3.153559
H  -1.170665 3.032494 -3.270181
H  0.333569 3.946987 -3.667585
O  0.234498 3.15751 -1.754493
O  0.506383 1.879011 -3.666135
H  2.374235 6.603255 -0.11073
C  2.978589 5.950767 0.52001
H  4.023946 6.235727 0.521377
O  2.46951 5.986206 1.867039
O  2.846008 4.593272 0.05944
O  8.516712 -2.835828 -0.234442
O  5.998225 5.026287 3.820569
O  -4.333574 3.261766 -2.420787
O  -3.573324 0.869158 6.743532
C  7.430182 4.976778 3.913167
C  4.245341 3.396403 5.442903
C  6.380108 4.717997 0.988991
C  8.863539 -0.319163 1.133471
C  9.495349 -2.281259 -1.127977
H  9.931442 -3.119333 -1.664595
H  9.028714 -1.602292 -1.839037
H  10.280009 -1.759491 -0.586524
C  5.963302 -4.008575 -0.89286
C  -3.564599 4.919717 -0.286938
C  -3.429652 0.564094 -2.823174
C  -5.718629 2.917194 -2.269714
H  -6.08879 3.229331 -1.29275
H  -6.254408 3.450279 -3.048574
H  -5.876863 1.84629 -2.388496
C  -0.837805 -0.428392 6.689583
C  -5.085031 1.490484 4.356802
C  -3.199039 2.002881 7.536713
H  -4.017853 2.179689 8.227757
H  -2.291705 1.814962 8.105684
H  -3.052202 2.882781 6.913519
Au 2.671946 -1.416186 2.398611
Au 0.203859 -0.975617 0.929447
P  -0.587929 0.993396 1.613398
H  7.706206 5.671319 4.700825
H  7.763214 3.975104 4.180842
H  7.909574 5.280688 2.98629
C  -5.363439 2.773702 5.149957
C  -5.582611 1.735598 2.928747
C  -5.919387 0.335626 4.92519
C  0.159621 0.573558 7.28494
C  -1.748212 -0.986571 7.78782
C  -0.02914 -1.632371 6.178792
H  -3.287105 5.507835 -1.161029
H  -4.649845 4.966912 -0.209838
H  -3.140593 5.394677 0.593611
H  -4.378665 0.054725 -2.652376
H  -3.549918 1.175293 -3.714269
H  -2.681746 -0.199673 -3.020342
C  6.632145 -4.03023 -2.274154
C  6.558418 -5.102472 0.00391
C  4.489779 -4.350835 -1.101494
C  3.632161 4.793269 5.6199
C  3.235893 2.394955 6.000322
C  5.523875 3.297369 6.285239
H  6.318296 5.738144 1.359175
H  7.433986 4.43949 0.975625
H  6.03128 4.700635 -0.040447
C  2.496847 -3.327876 3.517732
C  3.885386 -3.432481 3.354853
C  1.709068 -4.49278 2.939435
H  1.44441 -5.121348 3.790267
H  2.347166 -5.104149 2.30341
N  4.938921 -3.040445 4.094048
H  4.216426 -4.022298 2.507309
S  4.864691 -1.941678 5.465375
C  6.298351 -3.331833 3.619316
O  5.519498 -2.636309 6.583044
O  3.473719 -1.485325 5.589894
C  5.893602 -0.593818 4.899897
H  5.82285 0.156722 5.678986
H  5.485454 -0.225536 3.966487
H  6.914912 -0.935799 4.793409
H  6.976722 -3.35697 4.464017
H  6.625092 -2.58587 2.899965
H  6.301019 -4.311836 3.157859
O  0.628664 -2.911673 0.104848
C  0.652802 -3.982581 0.731402
O  0.906963 -5.106825 0.101913
C  0.397891 -4.18916 2.198103
C  -1.4657 -4.16748 3.167082
C  -0.733478 -5.266406 2.436125
C  -0.529443 -3.233347 2.919778
H  -0.407998 -6.113294 3.037322
H  -1.219816 -5.632209 1.534553
H  -0.392521 -2.215573 3.247009
H  2.127255 -2.968358 4.464824
C  -2.694874 -4.211043 3.926694
C  1.042048 -5.067646 -1.343786
H  1.358291 -6.06354 -1.623505
H  1.778044 -4.330456 -1.636512
H  0.077507 -4.830434 -1.781811
H  3.413538 4.962702 6.674065
H  4.300329 5.576324 5.280308
H  2.699356 4.872317 5.069187
H  5.269456 3.379487 7.341617
H  6.026835 2.343998 6.136056
H  6.223812 4.090074 6.049772
H  3.026476 2.642741 7.039147
H  2.293382 2.433525 5.457499
H  3.601753 1.370819 5.977501
C  -3.226946 -3.059035 4.521576
C  -4.371825 -3.134948 5.29375
C  -5.021308 -4.352929 5.471506
C  -4.51519 -5.498124 4.870617
C  -3.3608 -5.428884 4.105769
H  -2.7365 -2.105683 4.38065
H  -4.762276 -2.243186 5.761177
H  -5.917908 -4.406122 6.074481
H  -5.017221 -6.447278 5.001232
H  -2.963328 -6.325814 3.649492
H  9.484941 -1.117724 1.533137
H  9.421852 0.152659 0.32552
H  8.723659 0.428034 1.910381
H  6.446191 -6.072931 -0.479324
H  7.612198 -4.939719 0.201131
H  6.030106 -5.142118 0.955073
H  6.437995 -4.986382 -2.759788
H  6.226799 -3.243094 -2.909268
H  7.705701 -3.900833 -2.211072
H  4.415478 -5.332901 -1.564381
H  3.939263 -4.390495 -0.163012
H  3.997299 -3.638877 -1.76215
H  0.704213 0.111613 8.108377
H  0.883135 0.883061 6.535503
H  -0.328131 1.467883 7.663961
H  0.482522 -2.097312 7.019268
H  -0.673548 -2.379888 5.722915
H  0.734668 -1.356012 5.460717
H  -1.142241 -1.591483 8.461109
H  -2.229175 -0.2238 8.385995
H  -2.522091 -1.626704 7.37011
H  -6.976008 0.60154 4.901247
H  -5.787444 -0.563046 4.324797
H  -5.650495 0.108813 5.951051
H  -6.39205 3.088667 4.976233
H  -5.240504 2.631919 6.216207
H  -4.707305 3.581796 4.828727
H  -6.652644 1.930634 2.962826
H  -5.110093 2.60103 2.465735
H  -5.426865 0.871517 2.284593
totalener: -5375.64885839815906 hartree
cpcmener: -0.20198867184139 hartree
kineticenergy: 5178.16002428468801 hartree
xcener: -670.327257674761 hartree
dispersion: -0.740984272 hartree
dispersion: -0.744064899 hartree
dispersion: -0.745258117 hartree
dispersion: -0.742212992 hartree
dispersion: -0.742899398 hartree
dispersion: -0.743385097 hartree
dispersion: -0.743881077 hartree
dispersion: -0.742226367 hartree
dispersion: -0.743265604 hartree
dispersion: -0.743337682 hartree
dispersion: -0.743751952 hartree
dispersion: -0.743567964 hartree
dispersion: -0.743106124 hartree
dispersion: -0.743905421 hartree
dispersion: -0.743940418 hartree
dispersion: -0.743740318 hartree
dispersion: -0.743975588 hartree
dispersion: -0.743972296 hartree
dispersion: -0.744577144 hartree
dispersion: -0.744000442 hartree
dispersion: -0.744026043 hartree
dispersion: -0.743764242 hartree
dispersion: -0.743873773 hartree
dispersion: -0.744412978 hartree
dispersion: -0.744329649 hartree
dispersion: -0.744667507 hartree
dispersion: -0.744466704 hartree
dispersion: -0.744662978 hartree
dispersion: -0.743449191 hartree
dispersion: -0.749698610 hartree
dispersion: -0.747133547 hartree
dispersion: -0.744038490 hartree
dispersion: -0.746067173 hartree
dispersion: -0.746999701 hartree
dispersion: -0.744927599 hartree
dispersion: -0.743466205 hartree
dispersion: -0.743105259 hartree
dispersion: -0.743078252 hartree
dispersion: -0.743168307 hartree
dispersion: -0.743257257 hartree
dispersion: -0.744989676 hartree
dispersion: -0.743052237 hartree
dispersion: -0.742428272 hartree
dispersion: -0.742583178 hartree
dispersion: -0.742867126 hartree
dispersion: -0.742609227 hartree
dispersion: -0.742267441 hartree
dispersion: -0.742225841 hartree
dispersion: -0.742368934 hartree
dispersion: -0.742617497 hartree
dispersion: -0.742620609 hartree
dispersion: -0.742593060 hartree
dispersion: -0.742583923 hartree
dispersion: -0.742555295 hartree
dispersion: -0.742554804 hartree
dispersion: -0.742589451 hartree
dispersion: -0.742562125 hartree
dispersion: -0.742464543 hartree
dispersion: -0.742413449 hartree
dispersion: -0.742399669 hartree
dispersion: -0.742406782 hartree
dispersion: -0.742566102 hartree
dispersion: -0.742638788 hartree
dispersion: -0.742621268 hartree
dispersion: -0.742601774 hartree
dispersion: -0.742626087 hartree
dispersion: -0.742608138 hartree
dispersion: -0.742667882 hartree
elementType: P C H O Au N S
chargesum: 2.0000000
charge: 0.015625 -0.130877 -0.324707 -0.052137 -0.207613 -0.084054 -0.171020 0.009513 -0.122913 -0.256717 -0.095795 0.424590 -0.366894 0.197345 -0.034515 0.365835 0.043239 0.252229 0.087405 0.226808 0.037279 0.309177 -0.289572 0.374238 0.181370 0.222101 0.253326 0.215870 0.017221 0.238737 -0.341814 -0.392205 -0.344237 0.213009 -0.249345 -0.140002 0.019604 0.080342 0.236015 0.357323 0.226282 0.102577 0.357636 0.020238 0.219148 -0.106207 0.244879 0.120523 0.280792 -0.110300 0.218159 0.195256 -0.269147 -0.243665 0.192756 -0.126725 0.223594 -0.245514 -0.251091 -0.278353 -0.275404 -0.264616 -0.243151 -0.420154 0.107518 -0.792601 -0.769308 -0.419325 0.202131 0.202597 0.209220 0.161388 -0.694222 -0.702251 -0.360292 0.180841 0.199179 0.182595 -0.181389 0.091427 -0.412884 0.204205 0.180435 0.201932 -0.029318 0.109889 0.341416 0.201635 0.197456 0.208652 -0.624191 -0.570420 -0.645464 -0.556138 -0.439038 -0.592708 0.195431 0.191995 0.199711 0.206183 0.203214 0.196185 -0.603718 -0.581809 -0.685805 -0.558599 -0.608424 -0.601895 0.223299 0.224618 0.207993 -0.262262 -0.142336 -0.475668 0.218733 0.230026 -0.073328 0.225929 0.875632 -0.489455 -0.461565 -0.467951 -0.481503 0.226242 0.264461 0.245946 0.244589 0.249951 0.224586 -0.527755 0.383801 -0.174672 0.500738 -0.378515 -0.486738 -0.049047 0.217179 0.201279 0.244275 0.280707 0.073032 -0.394906 0.211973 0.208220 0.214955 0.178430 0.178906 0.138485 0.183353 0.167403 0.200888 0.203149 0.183446 0.170633 -0.117326 -0.182825 -0.194876 -0.207404 -0.172006 0.200015 0.195818 0.192309 0.195583 0.223474 0.215608 0.219319 0.202034 0.181917 0.181927 0.157494 0.182920 0.178000 0.198597 0.207266 0.196678 0.193118 0.184279 0.193946 0.177220 0.191586 0.174048 0.185116 0.177436 0.176615 0.144707 0.188255 0.181476 0.192880 0.184718 0.208686 0.181327 0.207982 0.188720 0.189471
charge: 1.025724 -0.249365 -0.264758 -0.282454 -0.031725 -0.154967 -0.166182 -0.156123 -0.145252 -0.149995 -0.023612 0.245338 -0.125302 0.191197 -0.003704 0.193251 -0.041473 0.191770 -0.033416 0.188444 -0.001228 0.192160 -0.254252 0.245217 0.234858 0.195505 0.208122 0.213507 -0.155911 0.236784 -0.274564 -0.269615 -0.130189 0.194100 -0.152930 -0.153371 -0.149913 -0.146697 0.195560 -0.008521 0.192028 0.000435 0.193019 -0.024722 0.188187 -0.033874 0.190943 0.219348 0.197033 0.311706 0.212530 0.205052 -0.605327 -0.577602 0.205264 0.309855 0.213999 -0.578947 -0.603525 -0.826180 -0.832117 -0.801300 -0.851691 -0.053868 -0.131846 -0.399693 -0.397359 -0.055324 0.187598 0.186653 0.178208 -0.134276 -0.389342 -0.396361 -0.044341 0.177495 0.189399 0.176650 -0.135078 -0.135364 -0.057826 0.189463 0.169802 0.184420 -0.039183 0.057329 1.042188 0.189636 0.182782 0.177285 -0.396104 -0.420015 -0.401949 -0.400151 -0.389089 -0.409494 0.177831 0.176758 0.167619 0.176738 0.180299 0.171413 -0.393647 -0.398199 -0.421873 -0.397600 -0.423424 -0.392740 0.180284 0.177722 0.173613 -0.307954 -0.003917 -0.221227 0.191167 0.190682 -0.236297 0.211999 1.746809 -0.304790 -0.819764 -0.845566 -0.492290 0.201084 0.200515 0.201632 0.186162 0.180157 0.187268 -0.518442 0.438035 -0.604749 -0.034857 -0.031293 -0.213575 -0.143994 0.181130 0.186485 0.194213 0.220174 -0.073409 -0.027609 0.201569 0.200279 0.200952 0.159843 0.178774 0.160750 0.161177 0.158588 0.176938 0.164515 0.162082 0.162531 -0.144671 -0.165150 -0.161615 -0.164096 -0.147787 0.185096 0.176691 0.176235 0.176587 0.182430 0.178738 0.177265 0.170389 0.160669 0.177471 0.158266 0.160355 0.161968 0.178041 0.166132 0.164986 0.163281 0.163087 0.163599 0.157413 0.163329 0.165517 0.162908 0.157446 0.173313 0.165738 0.160292 0.161257 0.175979 0.160617 0.174502 0.162045 0.164178 0.162062 0.162495
qa: 0.0156 -0.1309 -0.3247 -0.0521 -0.2076 -0.0841 -0.1710 0.0095 -0.1229 -0.2567 -0.0958 0.4246 -0.3669 0.1973 -0.0345 0.3658 0.0432 0.2522 0.0874 0.2268 0.0373 0.3092 -0.2896 0.3742 0.1814 0.2221 0.2533 0.2159 0.0172 0.2387 -0.3418 -0.3922 -0.3442 0.2130 -0.2493 -0.1400 0.0196 0.0803 0.2360 0.3573 0.2263 0.1026 0.3576 0.0202 0.2191 -0.1062 0.2449 0.1205 0.2808 -0.1103 0.2182 0.1953 -0.2691 -0.2437 0.1928 -0.1267 0.2236 -0.2455 -0.2511 -0.2784 -0.2754 -0.2646 -0.2432 -0.4202 0.1075 -0.7926 -0.7693 -0.4193 0.2021 0.2026 0.2092 0.1614 -0.6942 -0.7023 -0.3603 0.1808 0.1992 0.1826 -0.1814 0.0914 -0.4129 0.2042 0.1804 0.2019 -0.0293 0.1099 0.3414 0.2016 0.1975 0.2087 -0.6242 -0.5704 -0.6455 -0.5561 -0.4390 -0.5927 0.1954 0.1920 0.1997 0.2062 0.2032 0.1962 -0.6037 -0.5818 -0.6858 -0.5586 -0.6084 -0.6019 0.2233 0.2246 0.2080 -0.2623 -0.1423 -0.4757 0.2187 0.2300 -0.0733 0.2259 0.8756 -0.4895 -0.4616 -0.4680 -0.4815 0.2262 0.2645 0.2459 0.2446 0.2500 0.2246 -0.5278 0.3838 -0.1747 0.5007 -0.3785 -0.4867 -0.0490 0.2172 0.2013 0.2443 0.2807 0.0730 -0.3949 0.2120 0.2082 0.2150 0.1784 0.1789 0.1385 0.1834 0.1674 0.2009 0.2031 0.1834 0.1706 -0.1173 -0.1828 -0.1949 -0.2074 -0.1720 0.2000 0.1958 0.1923 0.1956 0.2235 0.2156 0.2193 0.2020 0.1819 0.1819 0.1575 0.1829 0.1780 0.1986 0.2073 0.1967 0.1931 0.1843 0.1939 0.1772 0.1916 0.1740 0.1851 0.1774 0.1766 0.1447 0.1883 0.1815 0.1929 0.1847 0.2087 0.1813 0.2080 0.1887 0.1895
va: 4.0746 3.3733 3.9225 3.6185 3.4026 3.7975 3.4945 3.8800 4.0243 3.7043 3.2184 3.4100 3.9287 0.9166 3.6449 0.7885 3.3403 0.8598 3.4118 0.9119 3.2566 0.8356 3.8528 3.6062 3.6601 0.9207 3.6321 3.6354 3.6510 3.5512 4.1771 4.0000 3.9236 0.9335 3.7733 3.6556 3.7119 3.6022 0.9134 2.4972 0.8437 3.1129 0.7904 3.5547 0.8925 3.5646 0.8785 3.5419 3.5009 3.6639 0.9177 0.9297 2.1028 2.1128 0.9300 3.6972 0.9131 2.1207 2.1204 1.9689 1.9854 1.9714 1.9846 3.6848 3.6865 3.7605 3.7568 3.6779 0.9428 0.9384 0.9339 3.6259 3.7564 3.7537 3.6861 0.9425 0.9444 0.9426 3.9584 3.7112 3.6860 0.9431 0.9460 0.9412 2.6111 2.1207 4.3581 0.9433 0.9384 0.9353 3.6873 3.7939 3.6616 3.6882 3.7133 3.6604 0.9408 0.9386 0.9396 0.9288 0.9419 0.9442 3.6634 3.6677 3.7897 3.6518 3.7649 3.6928 0.9227 0.9215 0.9389 3.6006 3.9735 3.8604 0.9277 0.9360 2.9950 0.9165 5.1684 3.7807 1.8695 1.8486 3.7264 0.9396 0.8789 0.9250 0.9243 0.8967 0.9382 1.9009 3.9107 2.1608 3.4019 4.0014 3.8899 3.4351 0.9205 0.9367 0.8559 0.9111 3.5748 3.7084 0.9425 0.9422 0.9335 0.9528 0.9814 0.9830 0.9495 0.9561 0.9524 0.9458 0.9466 0.9610 3.5759 3.9730 3.8882 3.9825 3.6342 0.8918 0.9276 0.9350 0.9304 0.9062 0.9258 0.9230 0.9419 0.9518 0.9773 0.9598 0.9484 0.9516 0.9521 0.9451 0.9382 0.9397 0.9532 0.9416 0.9563 0.9558 0.9667 0.9257 0.9499 0.9594 0.9897 0.9478 0.9551 0.9642 0.9474 0.9427 0.9490 0.9403 0.9486 0.9460
dispersion: -0.742699666 hartree
energy: -5376.996374116711 hartree
dipole: -9.537970450 13.715193579 4.177223129 342.552519144 -343.377892503 -0.825373359 150.362197003 -153.213745523 -2.851548520
dipolemethod: SCF
magnitude: 5.124623226 au
magnitude: 13.025757068 debye
temp: 298.15 k
press: 1.00 atm
zeropoint: 1.59143299 hartree
thermalvibcorrection: 0.10196266 hartree
thermalrotcorrection: 0.00141627 hartree
thermaltrasncorrection: 0.00141627 hartree
thermaltotal: -5375.30014592 hartree
thermalcorr: 0.10479521 hartree
nonthermalcorr: 1.59143299 hartree
totalcorr: 1.69622819 hartree
thermalcorrenthalpy: 0.00094421 hartree
totalenthalpy: -5375.29920171 hartree
vibrat: 0.18505350 hartree
rotat: 0.02015531 hartree
transl: 0.02291725 hartree
total: 0.22812606 hartree
totalentropycorr: -0.22812606 hartree
gibbsenthalpy: -5375.52732777 hartree
gibbsminuselec: 1.46904635 hartree
