program: Orca
programVersion: 6.1.1
elementType: P C C C C C C C C C C C C H C H C H C H C H C C C H C C C C C C C H C C C C H C H C H C H C H C C C H H O O H C H O O O O O O C C C C C H H H C C C C H H H C C C H H H Au Au P H H H H H H C C C H H H H H H C C C C C C H H H C C C H H N H S C O O C H H H H H H O C O C C C C H H H H C C H H H C C C C C H H H H H H H H H H H H H H C C C H H H H H H H H H H H H H H H H H H H H H H H H H H H
elementType: Au
charge: 2
multiplicity: 1
keywords: B97-3C Opt PAL32 CPCM(acetonitrile) VeryTightSCF
keywords: Freq
formula: C79H97Au2NO12P2S
InChI: InChI=1/C62H76O8P2.C17H21NO4S.2Au/c1-35-25-39(26-36(2)53(35)63-17)71(40-27-37(3)54(64-18)43(29-40)59(5,6)7)49-23-21-47-57(69-33-67-47)51(49)52-50(24-22-48-58(52)70-34-68-48)72(41-28-38(4)55(65-19)44(30-41)60(8,9)10)42-31-45(61(11,12)13)56(66-20)46(32-42)62(14,15)16;1-18(23(3,20)21)11-7-10-17(16(19)22-2)12-15(13-17)14-8-5-4-6-9-14;;/h21-32H,33-34H2,1-20H3;4-9,11-12H,10,13H2,1-3H3;;/q;-1;;+1/rC79H97Au2NO12P2S/c1-46-33-52(34-47(2)67(46)85-18)95(53-35-48(3)68(86-19)56(37-53)75(5,6)7)63-31-29-61-71(92-44-90-61)65(63)66-64(32-30-62-72(66)93-45-91-62)96(54-36-49(4)69(87-20)57(38-54)76(8,9)10,55-39-58(77(11,12)13)70(88-21)59(40-55)78(14,15)16)81-60(73(81)82(17)97(23,83)84)43-79(74(89-22)94-80(81)95)41-51(42-79)50-27-25-24-26-28-50/h24-41,60,73H,42-45H2,1-23H3
194 atoms
P  1.765112 -0.392301 0.429661
C  0.771495 0.299237 -0.939515
C  2.95931 -1.530319 -0.336127
C  2.776722 1.022651 0.948195
C  -0.100629 1.376936 -0.630702
C  1.099399 0.015222 -2.260222
C  2.533008 -2.605852 -1.111062
C  4.307002 -1.375351 -0.075227
C  3.438868 1.733582 -0.044687
C  2.978744 1.351151 2.28348
C  -0.549545 1.660311 0.746055
C  -0.467668 2.180026 -1.68543
C  0.622376 0.786082 -3.323777
H  1.779323 -0.789183 -2.485477
C  3.442343 -3.428009 -1.762884
H  1.473902 -2.77656 -1.222998
C  5.273555 -2.200313 -0.649328
H  4.620492 -0.58693 0.587392
C  4.371529 2.703379 0.280351
H  3.242462 1.526411 -1.088476
C  3.893591 2.334705 2.666457
H  2.412275 0.816795 3.030978
C  -1.499865 0.864525 1.445743
C  -0.057676 2.750801 1.426118
C  -0.132842 1.884788 -3.002695
H  0.873726 0.545894 -4.345744
C  4.82084 -3.139302 -1.59374
C  4.638958 2.94655 1.638011
C  -1.810124 1.142177 2.772685
C  -0.376053 3.018638 2.752899
C  -3.92747 -0.809498 1.494137
C  -2.904084 0.209756 -1.025778
C  -1.235618 2.21551 3.45969
H  -2.535982 0.53733 3.291797
C  -3.869965 -1.499879 2.705312
C  -5.164552 -0.437479 0.989847
C  -3.586787 1.420783 -1.072142
C  -2.670024 -0.499559 -2.198872
H  -1.480627 2.412469 4.492333
C  -5.010244 -1.813676 3.437979
H  -2.905967 -1.808138 3.071482
C  -6.337118 -0.745512 1.667981
H  -5.242958 0.104652 0.06092
C  -4.083231 1.916079 -2.27143
H  -3.735628 1.996799 -0.168472
C  -3.105524 -0.011045 -3.42265
H  -2.116805 -1.429139 -2.166174
C  -6.254449 -1.458592 2.871746
C  -3.82894 1.187698 -3.439176
C  -1.250725 3.821287 -2.988968
H  -2.273571 4.01758 -3.290452
H  -0.629771 4.715571 -3.036774
O  -1.232339 3.3053 -1.644699
O  -0.689162 2.8029 -3.838067
H  0.374262 5.567829 1.692322
C  0.921435 4.675492 1.996337
H  1.967028 4.882023 2.195125
O  0.30391 4.119334 3.175188
O  0.822025 3.67961 0.964583
O  5.721177 -3.821425 -2.379947
O  5.613709 3.847635 1.982884
O  -4.224608 1.687844 -4.65937
O  -7.39593 -1.771796 3.562035
C  6.95888 3.537512 1.584899
C  4.12028 2.672281 4.144679
C  5.045076 3.473209 -0.811896
C  6.717806 -1.98563 -0.16036
C  6.235686 -3.03409 -3.462545
H  6.91146 -3.677301 -4.01734
H  5.429735 -2.69957 -4.113991
H  6.777039 -2.162792 -3.102219
C  2.943676 -4.626685 -2.581124
C  -4.843456 3.203426 -2.294416
C  -2.781211 -0.726379 -4.694226
C  -5.589549 1.407651 -5.003364
H  -6.278783 1.85191 -4.286444
H  -5.755402 1.844269 -5.982997
H  -5.763178 0.332167 -5.049207
C  -4.905553 -2.519561 4.792514
C  -7.642599 -0.260864 1.118985
C  -8.358086 -2.618752 2.912648
H  -8.810001 -3.225134 3.692874
H  -9.133198 -2.036853 2.421245
H  -7.873558 -3.268825 2.186991
Au 0.865885 -1.606116 2.161234
Au -1.390857 -2.461569 0.342571
P  -2.392122 -0.465734 0.569897
H  7.608404 3.954813 2.3493
H  7.107932 2.460524 1.533883
H  7.205581 3.984318 0.62527
H  -8.295621 0.098471 1.9113
H  -7.475612 0.551878 0.417093
H  -8.179799 -1.045371 0.586985
C  -5.561265 -1.659906 5.883527
C  -5.569622 -3.901436 4.727061
C  -3.453666 -2.735726 5.213814
H  -4.723664 3.723007 -3.241065
H  -5.91131 3.028826 -2.15624
H  -4.516085 3.857385 -1.489862
H  -3.674424 -0.943111 -5.27688
H  -2.134246 -0.116934 -5.325383
H  -2.268492 -1.661946 -4.488567
C  3.539363 -5.914293 -1.99377
C  1.422559 -4.759993 -2.508463
C  3.312465 -4.511141 -4.065565
C  4.031982 4.182545 4.407587
C  3.067795 2.025882 5.039632
C  5.494811 2.141885 4.5756
H  5.203116 4.511392 -0.529348
H  6.018078 3.052433 -1.064667
H  4.438986 3.449616 -1.713978
C  0.488972 -3.291146 3.634635
C  0.117259 -2.21725 4.417406
C  -0.493665 -4.226196 2.996264
H  -0.955868 -4.84462 3.767481
H  -1.308012 -3.673705 2.532537
N  0.844199 -1.603657 5.392907
H  -0.88903 -1.830116 4.348536
S  2.353877 -2.264057 5.967953
C  0.439267 -0.256222 5.802244
O  2.734827 -1.416597 7.107666
O  2.126888 -3.705184 6.16584
C  3.548702 -2.039067 4.64723
H  4.465471 -2.494601 5.009388
H  3.204484 -2.538365 3.749514
H  3.6792 -0.978681 4.479247
H  0.990716 0.035889 6.684492
H  0.619512 0.451789 5.000409
H  -0.620965 -0.276494 6.039652
O  -1.099183 -4.591556 0.050952
C  -0.649452 -5.468367 0.808971
O  -0.834943 -6.737668 0.540463
C  0.204745 -5.171127 2.00014
C  2.206665 -5.833184 2.076493
C  0.933373 -6.378831 2.679273
C  1.598411 -4.79324 1.480613
H  0.890452 -6.333698 3.766913
H  0.626957 -7.366973 2.349423
H  1.918216 -3.985673 0.841885
H  1.448989 -3.740096 3.829696
C  3.5699 -6.296567 2.192756
C  -1.559333 -7.073664 -0.674729
H  -1.591413 -8.154869 -0.689563
H  -2.559685 -6.65607 -0.633109
H  -1.025186 -6.689209 -1.536847
C  4.63718 -5.573483 1.643104
C  5.933518 -6.038026 1.769722
C  6.193357 -7.226023 2.446956
C  5.144288 -7.948199 3.00028
C  3.842946 -7.486449 2.876581
H  4.446233 -4.64765 1.117327
H  6.749811 -5.472511 1.343955
H  7.209847 -7.583228 2.543525
H  5.339621 -8.87087 3.529758
H  3.027985 -8.051019 3.309764
H  3.24208 2.325612 6.071175
H  2.061824 2.337963 4.7672
H  3.110059 0.942841 5.011959
H  5.640521 2.318058 5.641274
H  5.56532 1.069071 4.397812
H  6.302612 2.630087 4.040888
H  4.222744 4.372467 5.463534
H  4.747751 4.748747 3.825407
H  3.032354 4.550838 4.185825
C  7.717903 -3.073851 -0.557307
C  7.233419 -0.624423 -0.648571
C  6.70193 -1.971029 1.381807
H  3.186084 -6.775376 -2.560935
H  4.623922 -5.906864 -2.027172
H  3.22836 -6.042514 -0.958389
H  1.120726 -5.646889 -3.061923
H  1.073211 -4.880557 -1.486998
H  0.907763 -3.907385 -2.949789
H  2.803779 -5.295386 -4.625595
H  2.99769 -3.551308 -4.473678
H  4.375954 -4.627035 -4.231839
H  -5.445516 -4.413097 5.681268
H  -6.630939 -3.836484 4.519322
H  -5.104262 -4.513327 3.95485
H  -3.435345 -3.216166 6.190009
H  -2.918421 -3.383924 4.523881
H  -2.914423 -1.793805 5.304193
H  -5.447902 -2.149232 6.850647
H  -5.077308 -0.68514 5.942767
H  -6.618621 -1.507585 5.70083
H  8.640269 -2.909361 -0.001609
H  7.350602 -4.065622 -0.310079
H  7.971774 -3.062387 -1.610395
H  8.241519 -0.453337 -0.271453
H  7.26872 -0.574323 -1.73528
H  6.603496 0.190891 -0.297541
H  7.719391 -1.846246 1.74849
H  6.109623 -1.158664 1.79436
H  6.311778 -2.906648 1.77812
totalener: -5375.65537720049178 hartree
cpcmener: -0.21534333121097 hartree
kineticenergy: 5178.20686522686083 hartree
xcener: -670.337402941075 hartree
dispersion: -0.735049692 hartree
dispersion: -0.735357122 hartree
dispersion: -0.735425140 hartree
dispersion: -0.736523745 hartree
dispersion: -0.736099956 hartree
dispersion: -0.734489838 hartree
dispersion: -0.735737431 hartree
dispersion: -0.735947356 hartree
dispersion: -0.734569002 hartree
dispersion: -0.734878958 hartree
dispersion: -0.734857414 hartree
dispersion: -0.734575679 hartree
dispersion: -0.735250027 hartree
dispersion: -0.735510893 hartree
dispersion: -0.737042072 hartree
dispersion: -0.738089353 hartree
dispersion: -0.737944735 hartree
dispersion: -0.737844922 hartree
dispersion: -0.738599410 hartree
dispersion: -0.737864304 hartree
dispersion: -0.738419033 hartree
dispersion: -0.738829291 hartree
dispersion: -0.738757802 hartree
dispersion: -0.738604352 hartree
dispersion: -0.738477534 hartree
dispersion: -0.738571932 hartree
dispersion: -0.739038279 hartree
dispersion: -0.738998134 hartree
dispersion: -0.739015333 hartree
dispersion: -0.738927702 hartree
dispersion: -0.738811058 hartree
dispersion: -0.738657443 hartree
dispersion: -0.738653876 hartree
dispersion: -0.738316704 hartree
dispersion: -0.738065049 hartree
dispersion: -0.737978766 hartree
dispersion: -0.737172697 hartree
dispersion: -0.737204991 hartree
dispersion: -0.737475988 hartree
dispersion: -0.737519144 hartree
dispersion: -0.737442962 hartree
dispersion: -0.737787652 hartree
dispersion: -0.738356763 hartree
dispersion: -0.739873383 hartree
dispersion: -0.741320943 hartree
dispersion: -0.739783106 hartree
dispersion: -0.740329127 hartree
dispersion: -0.740666398 hartree
dispersion: -0.740511393 hartree
dispersion: -0.741966078 hartree
dispersion: -0.741185524 hartree
dispersion: -0.740593559 hartree
dispersion: -0.740948784 hartree
dispersion: -0.741255599 hartree
dispersion: -0.741069216 hartree
dispersion: -0.741124198 hartree
dispersion: -0.741132688 hartree
dispersion: -0.741496155 hartree
dispersion: -0.741806789 hartree
dispersion: -0.742114876 hartree
dispersion: -0.742893107 hartree
dispersion: -0.742811447 hartree
dispersion: -0.742835274 hartree
dispersion: -0.743345279 hartree
dispersion: -0.743676716 hartree
dispersion: -0.743028638 hartree
dispersion: -0.744414942 hartree
dispersion: -0.743585797 hartree
dispersion: -0.743539239 hartree
dispersion: -0.743491785 hartree
dispersion: -0.743642216 hartree
dispersion: -0.743496037 hartree
dispersion: -0.743493915 hartree
dispersion: -0.743484128 hartree
dispersion: -0.743493995 hartree
dispersion: -0.743490867 hartree
elementType: P C H O Au N S
chargesum: 2.0000000
charge: 0.156289 -0.048524 -0.167989 -0.379601 -0.267325 -0.033128 -0.368583 -0.328135 0.042429 0.039668 -0.298712 0.439357 -0.358061 0.204180 0.224756 0.320611 0.393759 0.310905 0.001682 0.216761 0.008712 0.217186 -0.081672 0.466469 0.255652 0.219037 -0.009260 0.246580 -0.066991 0.149942 -0.305694 -0.196697 -0.317773 0.190057 -0.004468 0.026648 -0.031574 -0.054433 0.218613 -0.012585 0.197235 -0.032131 0.261612 -0.025100 0.253147 -0.049750 0.188208 0.278925 0.297590 -0.113388 0.216346 0.194830 -0.257612 -0.247847 0.198434 -0.128639 0.226697 -0.245327 -0.258475 -0.226974 -0.281127 -0.267556 -0.285391 -0.426681 0.080994 -0.766030 -0.224375 -0.385980 0.204263 0.196304 0.170991 0.076266 -0.713351 -0.695221 -0.364983 0.185596 0.200249 0.181546 0.108483 -0.756288 -0.425453 0.201939 0.211021 0.205043 -0.250014 0.319705 0.226982 0.200888 0.201568 0.211074 0.214838 0.203530 0.219418 -0.607827 -0.605675 -0.601542 0.207757 0.211001 0.201878 0.192050 0.194989 0.200834 -0.600857 -0.516555 -0.625164 -0.606188 -0.511511 -0.600838 0.215726 0.218043 0.203249 -0.277690 -0.013144 -0.761302 0.251318 0.300301 -0.102445 0.231053 0.935349 -0.400368 -0.506760 -0.492557 -0.471511 0.238354 0.214148 0.212055 0.216258 0.226966 0.203996 -0.521319 0.374655 -0.168861 0.441489 -0.436827 -0.290882 -0.089403 0.207375 0.200114 0.277203 0.306450 0.039273 -0.417518 0.219186 0.214478 0.211360 -0.068724 -0.209724 -0.181093 -0.213122 -0.181215 0.192149 0.191944 0.195010 0.197523 0.219929 0.197106 0.166129 0.127505 0.182642 0.174674 0.195131 0.180792 0.184893 0.159877 -0.429553 -0.544720 -0.537762 0.184255 0.180075 0.160206 0.204405 0.151601 0.189106 0.183581 0.181879 0.211417 0.183812 0.196688 0.177512 0.199739 0.203909 0.199686 0.184985 0.174055 0.186726 0.181410 0.145673 0.176326 0.186883 0.175573 0.184714 0.191609 0.176642 0.163858
charge: 1.022932 -0.250998 -0.270263 -0.275909 -0.033254 -0.153687 -0.175964 -0.141573 -0.144886 -0.142860 -0.033858 0.245910 -0.123505 0.194021 -0.000882 0.194627 -0.007726 0.190621 -0.036556 0.188331 -0.002858 0.190797 -0.250899 0.245708 0.237323 0.196039 0.215695 0.214543 -0.146876 0.235677 -0.267710 -0.274949 -0.125571 0.192937 -0.159564 -0.151783 -0.146793 -0.148865 0.196881 -0.000846 0.187657 -0.036927 0.191717 -0.029764 0.189580 -0.026037 0.190686 0.214642 0.199028 0.310583 0.213646 0.206629 -0.601065 -0.578165 0.205737 0.309054 0.212176 -0.584678 -0.599361 -0.851731 -0.828512 -0.803647 -0.827604 -0.054849 -0.132675 -0.396006 -0.137402 -0.055986 0.190647 0.179799 0.174115 -0.133227 -0.398324 -0.388573 -0.043157 0.177473 0.189543 0.177339 -0.135891 -0.396628 -0.055070 0.187627 0.178696 0.187265 -0.074337 0.082089 1.052767 0.188021 0.186299 0.178207 0.179394 0.170870 0.177774 -0.399479 -0.393785 -0.420372 0.181301 0.178313 0.173856 0.176700 0.177012 0.168250 -0.398489 -0.413100 -0.396969 -0.398674 -0.413910 -0.393512 0.178982 0.176526 0.171470 -0.249233 -0.052067 -0.236323 0.192694 0.199050 -0.255829 0.212349 1.735705 -0.294880 -0.844636 -0.846021 -0.492520 0.204726 0.198263 0.191193 0.192874 0.170915 0.179676 -0.551740 0.434842 -0.591699 -0.027187 -0.030386 -0.220876 -0.129758 0.181168 0.194371 0.195252 0.211583 -0.074713 -0.025699 0.201342 0.202467 0.201421 -0.141272 -0.166119 -0.158871 -0.163347 -0.144882 0.183894 0.174324 0.176836 0.177167 0.183178 0.166324 0.165110 0.154197 0.161034 0.161281 0.174141 0.160329 0.183075 0.160616 -0.389738 -0.402052 -0.406754 0.160330 0.175084 0.163543 0.164877 0.167785 0.163919 0.160162 0.161893 0.176315 0.161071 0.177501 0.161795 0.166644 0.163434 0.161889 0.160312 0.160965 0.179547 0.157828 0.165488 0.170636 0.162416 0.158105 0.161577 0.162192 0.159097 0.163830
qa: 0.1563 -0.0485 -0.1680 -0.3796 -0.2673 -0.0331 -0.3686 -0.3281 0.0424 0.0397 -0.2987 0.4394 -0.3581 0.2042 0.2248 0.3206 0.3938 0.3109 0.0017 0.2168 0.0087 0.2172 -0.0817 0.4665 0.2557 0.2190 -0.0093 0.2466 -0.0670 0.1499 -0.3057 -0.1967 -0.3178 0.1901 -0.0045 0.0266 -0.0316 -0.0544 0.2186 -0.0126 0.1972 -0.0321 0.2616 -0.0251 0.2531 -0.0498 0.1882 0.2789 0.2976 -0.1134 0.2163 0.1948 -0.2576 -0.2478 0.1984 -0.1286 0.2267 -0.2453 -0.2585 -0.2270 -0.2811 -0.2676 -0.2854 -0.4267 0.0810 -0.7660 -0.2244 -0.3860 0.2043 0.1963 0.1710 0.0763 -0.7134 -0.6952 -0.3650 0.1856 0.2002 0.1815 0.1085 -0.7563 -0.4255 0.2019 0.2110 0.2050 -0.2500 0.3197 0.2270 0.2009 0.2016 0.2111 0.2148 0.2035 0.2194 -0.6078 -0.6057 -0.6015 0.2078 0.2110 0.2019 0.1921 0.1950 0.2008 -0.6009 -0.5166 -0.6252 -0.6062 -0.5115 -0.6008 0.2157 0.2180 0.2032 -0.2777 -0.0131 -0.7613 0.2513 0.3003 -0.1024 0.2311 0.9353 -0.4004 -0.5068 -0.4926 -0.4715 0.2384 0.2141 0.2121 0.2163 0.2270 0.2040 -0.5213 0.3747 -0.1689 0.4415 -0.4368 -0.2909 -0.0894 0.2074 0.2001 0.2772 0.3065 0.0393 -0.4175 0.2192 0.2145 0.2114 -0.0687 -0.2097 -0.1811 -0.2131 -0.1812 0.1921 0.1919 0.1950 0.1975 0.2199 0.1971 0.1661 0.1275 0.1826 0.1747 0.1951 0.1808 0.1849 0.1599 -0.4296 -0.5447 -0.5378 0.1843 0.1801 0.1602 0.2044 0.1516 0.1891 0.1836 0.1819 0.2114 0.1838 0.1967 0.1775 0.1997 0.2039 0.1997 0.1850 0.1741 0.1867 0.1814 0.1457 0.1763 0.1869 0.1756 0.1847 0.1916 0.1766 0.1639
va: 3.9564 3.5564 3.8587 3.9105 3.4925 3.7543 3.6199 3.9513 3.7062 3.4177 3.6357 3.5225 3.9427 0.9254 3.0362 0.8366 2.4399 0.8043 3.4490 0.9098 3.3667 0.8707 3.3365 3.3424 3.4927 0.9253 3.6787 3.4862 3.8134 3.7218 3.7079 3.6668 3.9247 0.9354 3.3982 3.8354 3.8238 3.9012 0.9243 3.3533 0.8315 3.4907 0.8523 3.5796 0.8854 3.6091 0.9383 3.5689 3.5492 3.6806 0.9157 0.9306 2.1101 2.1217 0.9325 3.6491 0.9147 2.0936 2.1068 2.0143 1.9736 1.9609 1.9785 3.6917 3.7016 3.7518 4.0745 3.6708 0.9433 0.9471 0.9634 3.6625 3.7241 3.7699 3.6810 0.9416 0.9437 0.9421 3.6322 3.7552 3.6866 0.9436 0.9326 0.9366 2.3948 1.9547 4.3862 0.9446 0.9384 0.9322 0.9267 0.9410 0.9236 3.6490 3.6841 3.7843 0.9415 0.9310 0.9408 0.9391 0.9438 0.9402 3.7171 3.7709 3.6734 3.6678 3.7928 3.6929 0.9256 0.9235 0.9403 3.7224 3.7960 3.6867 0.9284 0.8728 3.0553 0.9142 5.2196 3.6963 1.8886 1.8584 3.7545 0.9340 0.9380 0.9255 0.9555 0.9042 0.9400 1.8855 3.8988 2.1727 3.3805 4.2339 3.8746 3.6763 0.9298 0.9519 0.7174 0.8709 3.6271 3.7191 0.9373 0.9363 0.9417 3.5915 3.9521 3.9103 3.9801 3.6727 0.9055 0.9335 0.9334 0.9302 0.9096 0.9562 0.9822 0.9485 0.9499 0.9529 0.9544 0.9524 0.9775 0.9689 3.7265 3.7045 3.6691 0.9479 0.9758 0.9728 0.9432 0.9673 0.9474 0.9507 0.9471 0.9414 0.9485 0.9536 0.9516 0.9546 0.9415 0.9392 0.9478 0.9523 0.9759 0.9465 0.9874 0.9591 0.9505 0.9579 0.9537 0.9481 0.9574 0.9737
dispersion: -0.743497725 hartree
energy: -5376.999231423157 hartree
dipole: 242.281254370 -244.240689891 -1.959435521 237.858026319 -237.242706329 0.615319990 -70.221684916 67.921189704 -2.300495213
dipolemethod: SCF
magnitude: 3.083874912 au
magnitude: 7.838587084 debye
temp: 298.15 k
press: 1.00 atm
zeropoint: 1.59195543 hartree
thermalvibcorrection: 0.10257720 hartree
thermalrotcorrection: 0.00141627 hartree
thermaltrasncorrection: 0.00141627 hartree
thermaltotal: -5375.30186625 hartree
thermalcorr: 0.10540975 hartree
nonthermalcorr: 1.59195543 hartree
totalcorr: 1.69736518 hartree
thermalcorrenthalpy: 0.00094421 hartree
totalenthalpy: -5375.30092204 hartree
vibrat: 0.18663809 hartree
rotat: 0.02016857 hartree
transl: 0.02291725 hartree
total: 0.22972391 hartree
totalentropycorr: -0.22972391 hartree
gibbsenthalpy: -5375.53064595 hartree
gibbsminuselec: 1.46858548 hartree
