program: Gaussian 16
title: Title
version: ES64L-G16RevA.03
frameworkgroup: C1[X(C13H13NO2)]
method: RPBE1PBE
basis: def2SVP
operation: Freq
keyword: #N
keyword: Geom=AllCheck
keyword: Guess=TCheck
keyword: SCRF=Check
keyword: GenChk
keyword: RPBE1PBE/def2SVPFreq
converged: YES YES NO YES
title: Mulliken charges:
elementType: C C C C C H H H H H N C O O C C C C H C H C H H H C H H H
charge: 0.035150 0.116784 -0.105813 -0.000604 -0.104257 0.063180 0.070496 0.046672 0.043520 0.051981 -0.334744 0.399480 -0.328028 -0.310848 0.156191 -0.021613 -0.024811 -0.042097 0.035543 -0.045313 0.038041 -0.019878 0.046080 0.046025 0.042425 -0.008685 0.053592 0.048293 0.053235
chargesum: -0.00000
title: Mulliken charges with hydrogens summed into heavy atoms:
elementType: C C C C C N C O O C C C C C C C
charge: 0.098330 0.187281 -0.059140 0.042915 -0.052275 -0.334744 0.399480 -0.328028 -0.310848 0.156191 0.013930 0.013231 0.003983 0.000712 0.022547 0.146436
1716.lowfreq: -5.7407 0.0006 0.0008 0.0010 0.9887 8.0679 21.9158 31.9492 68.2497
frequency: 21.8904 31.9320 68.2480 81.4757 95.7977 147.0309 197.8475 223.6193 260.6102 278.1713 330.8586 398.1435 422.3403 427.4655 441.5648 490.4005 525.7033 583.9863 608.8603 625.8184 651.8468 673.6224 716.0649 727.4855 772.1602 776.1025 787.6731 820.8181 850.9263 871.4135 883.5709 940.3669 946.8622 961.3079 998.5738 1002.3695 1016.0855 1019.5766 1028.4241 1046.6318 1051.1630 1064.0754 1095.3758 1121.7885 1133.4642 1154.3057 1161.8939 1170.6890 1188.7553 1276.9849 1314.4635 1319.9027 1324.8108 1355.6354 1372.5691 1394.7799 1401.0563 1422.0008 1450.3584 1454.8773 1470.9831 1493.3755 1538.0207 1676.5213 1679.3760 1685.4399 1736.2695 1836.6504 3058.5573 3122.0719 3164.9835 3165.2072 3206.6025 3211.9522 3220.2396 3225.4950 3229.3542 3236.4462 3241.6174 3243.4409 3271.7886
redmass: 3.7942 4.8301 4.1586 4.6496 6.5769 4.5075 4.9622 3.2506 1.0594 4.3183 4.1497 5.0563 2.6240 2.9077 3.7728 4.9275 3.2521 5.3287 6.1736 6.3213 3.0620 5.3528 1.8294 1.4624 2.7003 3.9931 1.4161 3.7395 1.2502 4.0569 2.7673 1.9014 1.6898 1.2988 1.3576 1.3673 2.1027 5.1006 1.3297 2.4677 2.1019 2.1131 1.3570 1.8877 2.2718 1.2468 1.0819 1.1326 1.1807 4.2321 2.0666 1.3482 1.6476 1.2350 1.3588 4.0671 5.3032 2.0580 1.0618 1.2671 2.1560 2.5754 2.7956 7.8282 6.9680 6.8251 6.1750 12.6346 1.0357 1.0872 1.1045 1.1052 1.0869 1.0868 1.0911 1.0998 1.0953 1.0989 1.0982 1.0922 1.0984
irintensity: 0.1537 0.8744 1.8195 0.9511 2.5982 1.3500 2.3158 1.0371 0.1986 4.6962 21.8298 12.6442 12.3710 0.2185 9.9171 7.9324 8.4689 8.6198 22.7617 3.0403 13.6154 12.6038 45.5852 107.2337 24.2041 65.3916 8.4569 3.4663 0.6104 3.5427 6.4324 27.2752 6.7112 3.1675 1.3135 0.1833 11.7616 12.3907 0.0681 87.0772 1.2059 157.4461 17.9571 45.8455 29.9784 28.8162 1.2114 13.3624 61.1551 628.6841 298.1376 1.4153 202.8795 0.1731 26.9226 461.7663 131.7812 570.0337 9.3744 1.8242 126.9476 4.4172 66.4957 173.0584 13.8740 19.8162 73.8511 743.5166 16.0540 3.8510 16.2573 14.1807 6.8318 0.3457 6.3601 15.4548 14.0050 3.8880 0.4755 3.3382 4.7692
temp: 298.150 k
press: 1.00000 atm
elementType: 6 6 6 6 6 1 1 1 1 1 7 6 8 8 6 6 6 6 1 6 1 6 1 1 1 6 1 1 1
symmnumber: 1
zpe: 620245.7 jmol-1
zpe.correction: 0.236239 hartree
zpe.thermalcorrener: 0.249892 hartree
zpe.thermalcorrenthalpy: 0.250836 hartree
zpe.thermalcorrgfe: 0.193887 hartree
zpe.sumelectzpe: -706.885398 hartree
zpe.sumelectthermal: -706.871745 hartree
zpe.sumelectthermalent: -706.870801 hartree
zpe.sumelectthermalfe: -706.927750 hartree
dipole: -0.5556 1.6363 0.3598
dipole: 1.7651
quadrupole: -75.6113 -94.4000 -89.3559
quadrupole: 1.5966 1.5218 4.1168
quadrupole: 10.8444 -7.9443 -2.9001 1.5966 1.5218 4.1168
hfenergy: -707.1216374 hartree
pointgroup: C01 [X(C13H13N1O2)]
dipole: 0.1040566 0.6630955 -0.1781277 debye
polarizability: 212.2744162|-23.293625|195.4334404|53.1014026|-15.2924058|167.6197839 unknown
InChI: InChI=1/13C.N.2O.13H
charge 0 multiplicity 1
29 atoms
C  -1.5318096 3.21730449 1.92752431
C  0.24103811 4.88468637 1.47174951
C  -0.552846 5.53186253 0.59594832
C  -1.74904824 4.87464926 0.0974966
C  -2.18799072 3.7470821 0.68128788
H  -1.52645516 2.11853402 1.90691162
H  1.1923629 5.27895019 1.8259546
H  -0.26021218 6.51741295 0.23254853
H  -2.26316591 5.29053537 -0.77284228
H  -3.06689012 3.2133738 0.31109719
N  -0.11751892 3.62710019 1.95681232
C  0.76658107 2.78002067 2.56486661
O  2.01893671 3.29163502 2.55436633
O  0.47243293 1.71508133 3.05341119
C  3.04425448 2.56695279 3.1289227
C  3.73309091 3.15168961 4.18709303
C  3.41587187 1.32435448 2.62069565
C  4.81834375 2.47839677 4.74704531
H  3.41418332 4.12785358 4.5573354
C  4.49767632 0.658165 3.19318906
H  2.86323669 0.88856949 1.78710195
C  5.2008773 1.23091738 4.25430069
H  5.36551335 2.93368006 5.57570656
H  4.79547288 -0.31723022 2.80150896
H  6.04967868 0.7042065 4.69588015
C  -2.26094409 3.67505864 3.18906145
H  -1.79098324 3.24341494 4.08528725
H  -2.24341534 4.77266347 3.26733043
H  -3.31098097 3.3486173 3.15637166
