program: Gaussian 09
title: 000075122
version: EM64L-G09RevD.01
frameworkgroup: C1[X(C9H14N2O2S3)]
method: RPBEPBE
basis: SDD
operation: Freq
keyword: #p
keyword: freq=noraman
keyword: PBEPBE/SDD
title: #p freq=noraman PBEPBE/SDD
converged: YES YES NO NO
title: Mulliken charges:
elementType: S S S O O N N C C C C C C C C C H H H H H H H H H H H H H H
charge: 0.269552 0.339115 0.325683 -0.217085 -0.187782 -0.021866 0.059640 -0.365219 -0.333745 -0.629734 -0.681056 -0.443279 -0.493326 -0.233200 -0.667587 0.040532 0.214492 0.216368 0.199744 0.212708 0.283413 0.298915 0.222323 0.208517 0.211431 0.238149 0.241157 0.216557 0.240073 0.235511
chargesum: 0.00000
title: Mulliken charges with hydrogens summed into heavy atoms:
elementType: S S S O O N N C C C C C C C C C
charge: 0.269552 0.339115 0.325683 -0.217085 -0.187782 -0.021866 0.059640 0.065641 0.078707 -0.047407 -0.038784 -0.443279 -0.493326 0.246105 0.024554 0.040532
polarizability: 2.81624001e+02 1.50728069e+01 1.37085458e+02 3.72308052e+00 -1.98254472e+00 1.32382575e+02
1716.lowfreq: -31.3840 -3.6072 -2.0818 -0.0033 -0.0028 -0.0014 9.0234 15.7007 21.7777
frequency: -29.1832 15.1524 21.7195 32.9176 46.9963 55.6191 66.7730 90.3438 100.9684 115.7109 123.5759 159.0659 201.1940 220.9817 240.1942 244.2526 260.9186 289.3456 306.5198 315.8366 356.6143 400.6670 420.7626 459.4356 494.7181 543.0332 574.6211 585.5761 602.8833 611.4567 646.0739 740.2617 771.3019 799.2972 803.6183 805.3961 870.6567 901.6141 921.6931 957.6386 1005.0079 1010.9604 1017.0051 1062.5334 1065.7598 1070.2144 1113.6861 1115.0067 1129.9596 1189.8139 1229.4592 1246.8853 1276.8610 1290.0729 1305.8799 1312.0608 1346.8058 1350.3091 1358.9904 1393.5130 1400.0877 1440.6939 1455.4695 1461.4262 1472.3177 1473.0207 1479.6485 1484.4124 1485.7317 1648.5548 2969.1902 2975.8333 2979.5049 2998.8348 3012.5603 3018.3011 3037.1117 3047.9722 3072.4041 3078.5599 3081.3381 3095.4774 3114.8939 3123.9039
redmass: 2.3015 4.9190 4.3082 5.3660 5.7346 4.7235 3.7930 2.4686 6.2634 3.9465 3.0916 6.3338 6.5897 1.6964 1.4313 1.2123 3.0070 8.1689 14.4210 8.3002 4.0795 14.1504 6.5721 5.0483 6.8764 12.7271 13.0986 8.6269 11.5144 5.0081 14.1911 1.1702 8.1093 1.0963 4.2198 1.6987 1.3972 13.1262 1.3474 12.5016 9.2095 2.1959 2.7560 6.1483 2.1047 1.3278 2.1110 2.2660 1.4269 1.4691 1.3250 1.1492 1.4630 1.3523 1.8836 1.5913 3.4780 1.8399 1.5758 1.2116 1.2509 1.0918 1.0751 1.0394 1.0696 1.0591 1.0418 1.0635 1.0769 11.7641 1.0598 1.0367 1.0604 1.0359 1.0976 1.0578 1.0927 1.0679 1.1010 1.0992 1.1072 1.0983 1.1037 1.1087
irintensity: 0.0519 0.2022 0.2165 0.2254 2.5277 1.9623 0.8746 0.8657 0.5327 0.5440 2.8741 2.8033 3.5147 0.6326 0.1505 0.6110 0.5941 11.6488 0.3031 1.6082 9.1381 2.8019 1.5997 11.5122 4.7205 7.0531 3.8091 2.9105 7.8673 4.8868 48.6492 14.3495 61.2706 3.9117 3.6048 1.5126 13.2044 44.7526 10.9946 104.2606 74.5404 56.5654 3.9966 411.6753 62.2198 2.2734 0.6882 26.6545 6.6619 4.7083 1.2956 0.0053 87.2705 53.7090 67.2223 24.8657 15.7779 8.8778 0.9305 11.3106 25.1318 22.6762 5.8263 14.7551 5.3111 4.9466 13.7251 14.1745 16.0500 407.3120 4.7999 43.5850 55.4333 11.4225 3.5604 20.7559 10.3388 15.1099 75.3516 42.8800 3.7523 25.8212 33.6988 10.1770
temp: 298.150 k
press: 1.00000 atm
elementType: 16 16 16 8 8 7 7 6 6 6 6 6 6 6 6 6 1 1 1 1 1 1 1 1 1 1 1 1 1 1
symmnumber: 1
zpe: 583020.6 jmol-1
zpe.correction: 0.222061 hartree
zpe.thermalcorrener: 0.240832 hartree
zpe.thermalcorrenthalpy: 0.241777 hartree
zpe.thermalcorrgfe: 0.170759 hartree
zpe.sumelectzpe: -1804.198575 hartree
zpe.sumelectthermal: -1804.179804 hartree
zpe.sumelectthermalent: -1804.178859 hartree
zpe.sumelectthermalfe: -1804.249877 hartree
dipole: 3.5181 4.0057 -1.1719
dipole: 5.4586
quadrupole: -114.3489 -110.7499 -121.6477
quadrupole: -12.1832 5.4173 2.8220
quadrupole: 1.2332 4.8322 -6.0655 -12.1832 5.4173 2.8220
hfenergy: -1804.4206359 hartree
pointgroup: C01 [X(C9H14N2O2S3)]
dipole: 1.2631157 -1.4562767 0.9464932 debye
polarizability: 278.378545|-26.3154669|138.6481131|3.0947174|-3.4647391|134.0653761 unknown
InChI: InChI=1S/C9H14N2O2S3/c1-3-5-6-14-7-10-11-8(15-7)16-9(12)13-4-2/h3-6H2,1-2H3
charge 0 multiplicity 1
30 atoms
S  2.37177 0.107459 0.658397
S  -0.508458 1.333855 0.890261
S  -3.111703 2.0052 -0.821743
O  -3.458768 -0.507555 0.115073
O  -5.440761 0.693001 -0.250013
N  0.504033 0.342311 -1.385295
N  -0.791197 0.776692 -1.716413
C  4.610452 -1.208782 -0.44863
C  5.626412 -0.173632 0.089383
C  3.259265 -0.621238 -0.878538
C  6.993407 -0.811384 0.415974
C  0.81119 0.546477 -0.094648
C  -1.454569 1.300108 -0.691674
C  -4.24425 -1.71635 0.566591
C  -3.217535 -2.7833 0.919796
C  -4.204455 0.583471 -0.259509
H  4.454253 -2.009462 0.301598
H  5.042154 -1.703493 -1.343454
H  5.757791 0.63011 -0.662826
H  5.218584 0.313963 0.996794
H  3.362589 0.203812 -1.601401
H  2.576462 -1.378086 -1.294553
H  7.70753 -0.057252 0.79292
H  7.439099 -1.279476 -0.482068
H  6.892261 -1.596066 1.189204
H  -4.864824 -1.411351 1.427798
H  -4.907171 -2.014118 -0.264853
H  -3.738628 -3.697497 1.257961
H  -2.598181 -3.039832 0.044087
H  -2.553853 -2.441187 1.731681
