program: Gaussian 16
title: Title
version: ES64L-G16RevC.01
method: RPBE1PBE
basis: def2SVP
operation: Freq
keyword: #N
keyword: Geom=AllCheck
keyword: Guess=TCheck
keyword: SCRF=Check
keyword: GenChk
keyword: RPBE1PBE/def2SVP
keyword: Freq
converged: YES YES YES YES
title: Mulliken charges:
elementType: C C C C C H H H H H N C O O C C C C H C H C H H H C H H H C C C C C C H H H H H H H H C C B O O H C H H H C H H H C H H H C H H H
charge: -0.009365 0.081224 -0.088946 -0.038884 -0.056808 0.051228 0.051791 0.038379 0.080239 0.034618 -0.318991 0.399750 -0.330950 -0.321006 0.152928 -0.026528 -0.026726 -0.040244 0.037862 -0.043238 0.035894 -0.021603 0.044461 0.045272 0.041863 0.033099 0.049546 0.046155 0.050959 0.009106 -0.132885 -0.179400 0.039880 -0.057081 -0.063430 0.033986 0.044057 0.041978 0.043248 0.034657 0.035004 0.035990 0.037166 -0.142934 -0.129159 0.185648 -0.278101 -0.272279 0.047711 0.038078 0.048325 0.043123 0.053270 0.016971 0.051779 0.049032 0.061251 0.034387 0.048037 0.043603 0.052739 0.020744 0.051740 0.050980 0.050802
chargesum: -0.00000
title: Mulliken charges with hydrogens summed into heavy atoms:
elementType: C C C C C N C O O C C C C C C C C C C C C C C C B O O C C C C
charge: 0.041863 0.133015 -0.050567 0.041355 -0.022190 -0.318991 0.399750 -0.330950 -0.321006 0.152928 0.011334 0.009167 0.004217 0.002034 0.020260 0.179759 0.100874 -0.098899 -0.179400 0.125106 0.012579 0.009726 -0.142934 -0.129159 0.185648 -0.278101 -0.272279 0.182795 0.179033 0.178766 0.174265
chargesum: 0.00000
1716.lowfreq: -6.3508 -3.8321 -3.1797 -0.0012 -0.0010 -0.0002 10.4422 12.0412 20.8353
frequency: 6.7337 11.0406 20.8244 30.2672 47.0175 49.3954 65.3134 76.3146 82.9158 90.1411 103.9869 116.4490 122.0254 158.1119 187.7936 197.8533 207.4500 217.2929 228.4057 239.0606 244.3443 249.6290 266.1565 282.4536 287.4688 299.3548 310.1362 314.5015 319.3467 337.5043 359.9664 365.2772 378.2613 388.0263 410.0056 420.9131 425.6496 428.2036 456.5341 491.7176 509.7998 513.2957 525.6249 529.5847 546.3803 557.8242 585.5113 596.3118 614.1795 626.3688 627.5256 654.3644 678.8559 692.4253 716.2520 728.1008 766.7433 771.1157 777.9129 789.3105 813.7537 833.3726 851.1625 852.3972 862.0503 874.0997 875.8700 881.1501 895.5413 903.6549 929.0228 937.1274 938.2948 938.9879 948.2741 959.5922 966.5568 975.0101 975.8435 985.5086 998.1211 998.6038 1002.0391 1014.5252 1019.6168 1028.1857 1041.1525 1049.7027 1053.9041 1070.1528 1087.4546 1093.3339 1097.1186 1101.2014 1121.4752 1139.6118 1141.5793 1151.1705 1160.8853 1161.5101 1168.5901 1174.7837 1179.1396 1195.7056 1197.0615 1212.1832 1250.1511 1251.8817 1259.5304 1277.1894 1280.1675 1280.9236 1283.8278 1301.2100 1317.9206 1318.4013 1325.6161 1337.8304 1349.6165 1360.1842 1370.7774 1372.6697 1381.5032 1381.9443 1383.1492 1387.4613 1389.2035 1389.7705 1392.9001 1397.8227 1399.2874 1412.3187 1424.0659 1429.4954 1434.6350 1435.6914 1442.0433 1443.3580 1447.9274 1449.6380 1450.3704 1457.3189 1458.3412 1462.0867 1466.7092 1467.5089 1469.3666 1481.3988 1492.6911 1538.8456 1678.9914 1685.2805 1742.6485 1758.7695 1831.0241 3004.7258 3023.3956 3025.6004 3047.8503 3051.8365 3064.0412 3064.9196 3067.3607 3069.4330 3071.8229 3074.3020 3081.4003 3083.1342 3112.7318 3115.7150 3142.0701 3161.8244 3162.9587 3164.6122 3164.7687 3167.7623 3169.9865 3172.9605 3178.9810 3183.2571 3183.4661 3191.5310 3210.9594 3215.7635 3218.8507 3227.1703 3233.6886 3237.9607 3253.8880
redmass: 3.7323 5.0506 3.5336 4.5402 3.6979 5.8928 3.3395 5.2522 4.2763 6.7762 3.5319 4.2015 3.4703 3.0703 4.2677 3.3963 3.3895 1.6170 2.0845 1.2601 1.5806 1.5567 2.0431 3.4845 2.7410 1.7639 1.2336 1.4820 1.5872 2.2320 2.7656 2.6594 2.3206 3.4890 4.8746 3.7013 3.6297 2.9512 2.2792 3.4844 3.3636 3.6009 2.9320 3.2765 3.6369 3.6487 4.1715 4.8479 4.8013 4.9263 4.2837 2.7558 3.8558 3.6285 1.8141 2.3283 5.0372 2.1334 2.4356 3.1468 1.3709 3.5839 1.2669 2.9724 2.1130 3.3000 3.0648 2.6577 2.6222 2.3459 2.0812 1.4163 1.4613 1.4410 1.7240 2.1376 1.2804 1.6978 1.7581 2.3071 1.3691 1.5743 1.3692 1.5937 5.0644 1.3372 1.9230 2.1272 1.8735 1.7839 1.7951 1.3608 1.3191 2.5701 1.6381 2.4544 1.4568 1.8011 1.6263 1.0925 1.1372 1.7793 2.1727 2.7688 1.4619 1.6011 2.5421 1.5413 1.4781 3.2481 2.1064 2.4211 1.2690 2.8537 1.3671 1.3804 1.4142 2.0847 1.6414 1.4335 1.5567 4.4677 1.6125 1.5611 1.6504 1.6932 1.5835 1.3895 1.7442 3.3098 3.4952 3.8509 2.3714 1.1006 1.0687 1.0874 1.0540 1.0688 1.0824 1.0828 1.1098 1.4139 1.0563 1.1171 1.0739 1.4454 1.1752 1.0678 2.5680 2.8483 7.0233 6.7785 7.2873 7.5520 12.6056 1.0817 1.0676 1.0674 1.0675 1.0656 1.0367 1.0371 1.0373 1.0378 1.0403 1.0919 1.0878 1.0947 1.1004 1.1050 1.0882 1.1050 1.1044 1.1042 1.1047 1.1039 1.1026 1.1044 1.1047 1.1039 1.1038 1.0910 1.0866 1.0897 1.0907 1.0947 1.0984 1.0998 1.0976
irintensity: 0.1098 0.0926 0.0928 0.2423 0.2818 0.8499 0.4534 1.2757 1.6586 2.7659 0.5125 3.2451 0.1703 0.2293 1.8851 0.6811 0.1652 0.1924 0.9200 0.0456 0.8944 0.4215 0.6266 8.1634 1.6564 0.1780 0.1189 3.3155 1.1208 1.3984 3.4246 3.3367 1.8723 3.9963 4.6079 9.0801 0.1313 0.0209 6.4003 3.8446 7.2695 10.8261 3.1037 3.0584 4.1685 26.0154 23.0591 6.4623 45.1031 17.1800 2.7703 0.9733 15.7142 4.0517 50.8687 80.8874 75.0018 27.4176 15.5486 10.2638 3.0802 6.7893 1.1470 0.3211 7.8905 4.9756 8.3827 34.1777 2.6461 77.4690 8.0915 5.8728 2.4962 13.0349 11.8434 2.9919 8.1988 1.2900 7.8573 20.4427 0.6369 4.8703 0.3522 10.3197 13.9400 0.1113 164.1199 4.4346 64.3006 1.7541 3.7405 18.4273 11.0439 105.7453 13.8193 11.5351 9.3082 25.2396 155.1294 7.1801 24.3307 112.3506 192.5701 60.4347 12.5649 4.5799 28.7577 10.3647 27.0234 495.2145 152.6203 23.5558 68.0699 35.9580 2.1263 7.5729 19.5797 117.9162 43.1541 25.7876 8.1104 418.7048 22.2637 18.9855 30.4916 68.8764 132.8974 76.0257 325.9317 95.6866 163.7208 262.8772 98.6742 1.9521 4.6656 4.2528 3.6439 0.8066 76.7442 5.1130 13.9674 210.9228 7.1238 5.7129 4.7728 166.5285 77.1797 13.5760 3.6904 51.3017 10.1565 26.0592 114.8687 1.8935 872.6978 27.6050 64.7455 33.7301 33.1574 30.5104 11.6091 25.3745 15.0240 17.7737 32.2790 42.8853 25.5353 49.7854 60.6661 57.7241 5.1603 2.0253 2.7148 33.4251 18.7108 35.5466 18.1517 20.2407 7.4196 13.8085 26.4859 3.7063 0.5850 5.8335 4.9509 13.9334 6.7476 0.9402 7.1036
temp: 298.150 k
press: 1.00000 atm
elementType: 6 6 6 6 6 1 1 1 1 1 7 6 8 8 6 6 6 6 1 6 1 6 1 1 1 6 1 1 1 6 6 6 6 6 6 1 1 1 1 1 1 1 1 6 6 5 8 8 1 6 1 1 1 6 1 1 1 6 1 1 1 6 1 1 1
symmnumber: 1
zpe: 1467576.3 jmol-1
zpe.correction: 0.558970 hartree
zpe.thermalcorrener: 0.588531 hartree
zpe.thermalcorrenthalpy: 0.589475 hartree
zpe.thermalcorrgfe: 0.495971 hartree
zpe.sumelectzpe: -1350.766190 hartree
zpe.sumelectthermal: -1350.736630 hartree
zpe.sumelectthermalent: -1350.735685 hartree
zpe.sumelectthermalfe: -1350.829189 hartree
dipole: 4.0832 1.3024 -1.5196
dipole: 4.5473
quadrupole: -161.0433 -172.2544 -186.9151
quadrupole: 1.9461 2.9552 -2.7854
quadrupole: 12.3610 1.1498 -13.5108 1.9461 2.9552 -2.7854
hfenergy: -1351.3251606 hartree
pointgroup: C01 [X(C25H34B1N1O4)]
dipole: -1.5968573 0.196504 -0.7823955 debye
polarizability: 427.6178504|-26.5615349|328.9077778|-3.8296455|22.1598357|374.0904901 unknown
InChI: InChI=1/25C.B.N.4O.34H
charge 0 multiplicity 1
65 atoms
C  0.55729167 0.44578015 2.42639482
C  0.83855061 2.07667797 0.63100056
C  -0.48447305 2.28622687 0.59501206
C  -1.47514386 1.38016263 1.25575376
C  -0.81904744 0.10386942 1.81591432
H  1.05428869 -0.48531304 2.72643528
H  1.55255614 2.71335789 0.1090068
H  -0.85297008 3.16009728 0.05264105
H  -1.92557362 1.92997863 2.10791917
H  -1.45138131 -0.27688249 2.6342227
N  1.38791025 1.01552746 1.36871842
C  2.50705724 0.34447142 0.98521206
O  3.03479035 0.88983385 -0.140213
O  2.98510084 -0.613101 1.55008183
C  4.18008141 0.32705831 -0.66372211
C  4.08584069 -0.31773079 -1.89344863
C  5.40097007 0.45466356 -0.00586277
C  5.23844368 -0.84279422 -2.47711675
H  3.11168087 -0.39705976 -2.38017914
C  6.54554976 -0.07846536 -0.59546512
H  5.44787552 0.96793926 0.95615619
C  6.46844329 -0.72646169 -1.8296176
H  5.17162958 -1.34729809 -3.44376876
H  7.50722875 0.01686392 -0.08588805
H  7.36973593 -1.13983226 -2.28762025
C  0.48099089 1.37374649 3.62796481
H  1.48130635 1.52646505 4.05859389
H  0.07198523 2.35755617 3.35576848
H  -0.16484017 0.93403478 4.40209895
C  -0.23475176 -1.93463663 -1.48286748
C  -0.45184236 -0.83192683 -0.49008175
C  -0.64307004 -1.02531208 0.82524177
C  -0.62660805 -2.40879889 1.42060254
C  0.03242264 -3.4332925 0.50835821
C  -0.51757545 -3.31703243 -0.90658419
H  -0.43989237 0.18847137 -0.88492264
H  -0.85608696 -1.75310867 -2.37745293
H  -0.11718434 -2.38139003 2.39931938
H  -1.66894099 -2.70607964 1.64540538
H  1.12184197 -3.25031155 0.49330122
H  -0.1142337 -4.45028164 0.90479374
H  -0.09600906 -4.09656279 -1.56035787
H  -1.60846619 -3.48640581 -0.87903952
C  -4.25608295 1.09459565 -1.30762023
C  -4.58575744 -0.07731661 -0.31415056
B  -2.71416607 1.01120211 0.35334355
O  -3.73866257 0.23096787 0.81238812
O  -2.91438928 1.45968856 -0.91972821
H  0.8093179 -1.88095309 -1.84698649
C  -4.25233751 0.70155686 -2.77190175
H  -4.00766994 1.57797773 -3.38951949
H  -3.50967216 -0.07994767 -2.97761792
H  -5.24335447 0.33547276 -3.0780979
C  -4.15229174 -1.44093976 -0.83621842
H  -4.22822886 -2.17378208 -0.01976065
H  -4.79053772 -1.77901405 -1.66439606
H  -3.10728065 -1.42125264 -1.17497247
C  -6.02749384 -0.12663295 0.15229635
H  -6.16138168 -0.96896422 0.84655513
H  -6.31803775 0.79480231 0.6728433
H  -6.70556179 -0.27842542 -0.70044135
C  -5.12680279 2.32500543 -1.08992691
H  -6.15966842 2.1544247 -1.4244148
H  -5.14526371 2.61888417 -0.03021087
H  -4.71023372 3.16170359 -1.66917702
