program: Gaussian 16
title: Title
version: ES64L-G16RevA.03
frameworkgroup: C1[X(C12H24B2O4)]
method: RPBE1PBE
basis: def2SVP
operation: Freq
keyword: #N
keyword: Geom=AllCheck
keyword: Guess=TCheck
keyword: SCRF=Check
keyword: GenChk
keyword: RPBE1PBE/def2SVPFreq
converged: YES YES YES YES
title: Mulliken charges:
elementType: C C C C B B O O O O C H H H C H H H C H H H C H H H C H H H C H H H C H H H C H H H
charge: -0.142223 -0.142225 -0.142022 -0.142022 0.120342 0.123978 -0.274368 -0.274365 -0.275027 -0.275028 0.020309 0.051294 0.052139 0.051339 0.034104 0.053474 0.048673 0.044438 0.020307 0.051293 0.052140 0.051340 0.034105 0.053474 0.048673 0.044437 0.033961 0.048708 0.053341 0.044521 0.020517 0.051975 0.051396 0.051290 0.033963 0.048708 0.053341 0.044521 0.020518 0.051975 0.051396 0.051289
chargesum: -0.00000
title: Mulliken charges with hydrogens summed into heavy atoms:
elementType: C C C C B B O O O O C C C C C C C C
charge: -0.142223 -0.142225 -0.142022 -0.142022 0.120342 0.123978 -0.274368 -0.274365 -0.275027 -0.275028 0.175081 0.180689 0.175080 0.180689 0.180531 0.175178 0.180533 0.175177
chargesum: 0.00000
1716.lowfreq: -8.5104 -8.0704 -0.0007 -0.0005 -0.0003 7.8417 12.5039 38.8665 49.4924
frequency: 11.0908 38.8591 49.4923 94.3022 98.6729 108.3050 192.2144 208.5792 222.4855 232.8472 244.4094 250.2379 284.2468 296.9683 297.7963 302.1394 310.6728 312.6951 318.0637 322.2853 343.0639 360.1866 368.0449 369.6342 371.7804 386.1038 417.0727 455.4558 471.1021 521.1214 531.0690 533.1234 553.2968 590.0939 592.6370 682.9704 689.4900 697.0628 758.7538 857.5816 858.2640 871.9196 881.9062 894.7452 937.7238 938.3953 938.9360 939.1207 969.8897 972.8161 980.9314 987.3070 997.6217 998.1301 1008.0399 1011.9134 1135.0379 1135.5364 1161.8910 1178.3312 1194.2867 1194.5924 1210.6929 1248.4140 1248.8000 1280.4801 1281.1425 1306.0024 1306.6408 1329.1400 1361.9248 1381.4824 1381.6891 1387.7053 1387.8416 1389.4400 1389.8742 1395.0917 1397.7723 1434.7515 1435.7561 1442.0392 1442.1751 1442.1912 1442.9990 1447.5448 1449.5435 1449.9881 1458.4181 1459.7638 1466.1191 1466.3430 1467.6062 1469.9979 1481.4091 1482.5838 3064.2690 3064.6801 3064.7283 3065.1669 3068.5300 3069.9861 3071.2968 3071.5213 3161.7518 3162.0713 3162.2002 3162.9847 3164.6376 3164.9231 3165.6662 3165.6837 3172.5304 3173.1522 3173.3724 3173.8534 3183.3341 3183.5254 3183.7980 3184.1374
redmass: 3.4348 3.6075 4.2417 3.4841 3.5216 4.1269 3.4778 2.7742 1.2150 1.2284 1.1807 1.1510 2.0711 1.9575 2.4425 1.9185 1.1767 1.1913 1.0864 1.0999 2.7681 2.5303 2.2665 2.9354 2.1158 2.2678 2.5583 3.9449 2.7919 2.6774 3.3163 3.3312 4.8992 3.8837 3.8514 3.2159 3.2053 10.0930 8.6917 7.5857 3.3679 3.5368 2.3615 2.4010 1.4781 1.4729 1.4059 1.4058 1.6704 1.6966 1.7425 1.7131 1.3223 1.3315 1.3615 1.4478 2.5008 2.5590 3.4138 2.6844 2.7487 2.7550 5.9325 2.9140 2.9245 2.4828 2.4875 2.9069 2.8640 7.5988 6.8890 1.3488 1.3635 1.5615 1.5818 1.3712 1.3655 1.3555 1.3344 1.0622 1.0615 1.0523 1.0521 1.0818 1.0986 4.1320 1.0607 1.0659 1.0496 1.0521 1.0664 1.0679 1.1009 1.2111 1.0712 1.0704 1.0366 1.0368 1.0366 1.0368 1.0381 1.0379 1.0381 1.0381 1.1045 1.1049 1.1048 1.1045 1.1045 1.1044 1.1043 1.1043 1.1047 1.1046 1.1043 1.1043 1.1038 1.1038 1.1038 1.1038
irintensity: 0.0000 3.4038 2.7547 0.0087 0.0871 0.0013 0.0100 0.0183 0.2198 0.0090 0.2142 0.0207 0.9739 0.6878 0.0036 0.0024 0.0476 0.0349 0.1208 0.0581 0.5550 0.9935 0.0006 0.6570 0.0014 1.1645 0.0009 0.4887 8.5034 2.3900 5.1677 0.0014 71.5241 0.5284 10.2797 9.5057 0.0001 0.7730 34.1335 0.0000 8.5285 0.0687 104.4397 0.6797 1.5813 0.5098 0.0052 0.0129 8.0229 0.1164 27.2533 0.0167 0.2421 0.0504 0.0068 0.0154 1.5233 17.7905 969.8976 1.8613 42.9397 68.0930 313.5742 12.1698 63.0450 0.0124 0.0376 0.3035 3.7615 663.3665 3.7587 93.1518 6.2261 0.2162 0.1509 42.7042 13.4809 18.6528 29.3792 0.0128 0.0174 3.4878 3.8703 0.0558 0.0870 0.0129 14.1027 1.1133 7.1158 5.8518 6.1841 1.4636 10.8162 0.3946 7.7010 7.4368 0.7223 27.7259 0.6466 29.1153 16.5033 17.6827 22.1073 5.9438 7.3418 4.2417 3.8309 2.7346 1.1105 1.1116 28.5117 92.0429 5.5329 5.0349 38.3705 32.9559 26.4056 8.4020 8.5881 25.9593
temp: 298.150 k
press: 1.00000 atm
elementType: 6 6 6 6 5 5 8 8 8 8 6 1 1 1 6 1 1 1 6 1 1 1 6 1 1 1 6 1 1 1 6 1 1 1 6 1 1 1 6 1 1 1
symmnumber: 1
zpe: 954826.4 jmol-1
zpe.correction: 0.363674 hartree
zpe.thermalcorrener: 0.383377 hartree
zpe.thermalcorrenthalpy: 0.384321 hartree
zpe.thermalcorrgfe: 0.316227 hartree
zpe.sumelectzpe: -820.678681 hartree
zpe.sumelectthermal: -820.658978 hartree
zpe.sumelectthermalent: -820.658034 hartree
zpe.sumelectthermalfe: -820.726128 hartree
dipole: -0.0099 -0.0001 0.0000
dipole: 0.0099
quadrupole: -77.8497 -113.1510 -107.5832
quadrupole: 0.0001 0.0000 4.0836
quadrupole: 21.6783 -13.6231 -8.0552 0.0001 0.0000 4.0836
hfenergy: -821.042355 hartree
pointgroup: C01 [X(C12H24B2O4)]
dipole: -0.0000135 0.0000313 0.0039009 debye
polarizability: 185.7369311|1.5799901|199.5198809|0.0029275|0.0145658|221.296418 unknown
InChI: InChI=1/12C.2B.4O.24H
charge 0 multiplicity 1
42 atoms
C  -0.13975816 0.76890979 -2.98863241
C  0.13909135 -0.77295598 -2.98764821
C  0.01005068 -0.78147005 2.98886846
C  -0.00937167 0.78550243 2.98779356
B  0.00011648 0.00054587 0.85476321
B  -0.00008009 -0.00061426 -0.85471879
O  -0.34269412 1.08488921 1.61378505
O  0.34308183 -1.08274988 1.61520984
O  0.5171542 -1.01349785 -1.61364302
O  -0.51749349 1.0112676 -1.6148604
C  1.36020916 1.39914625 3.25077054
H  1.31670989 2.47501315 3.02804897
H  1.66289682 1.27598727 4.30012637
H  2.13038492 0.94798465 2.60821039
C  -1.04989531 1.41122353 3.89582649
H  -0.86847712 1.13067552 4.94390601
H  -0.99292686 2.50704364 3.82289727
H  -2.06656765 1.10304954 3.62065476
C  -1.35947721 -1.3947469 3.25298217
H  -1.31601775 -2.47092488 3.031761
H  -1.66195957 -1.27011547 4.30222271
H  -2.12977956 -0.94449077 2.6099378
C  1.0507617 -1.40594727 3.89754547
H  0.86956997 -1.12395442 4.94527582
H  0.99376324 -2.50186623 3.82613438
H  2.06738026 -1.09816805 3.62173394
C  -1.26915691 1.21085767 -3.89840652
H  -1.39279077 2.30160363 -3.83224614
H  -1.0445848 0.95706731 -4.94503148
H  -2.22133492 0.74161603 -3.62006862
C  -1.10973655 -1.60544116 -3.24991829
H  -1.42866732 -1.53566022 -4.29932371
H  -0.88816427 -2.6588188 -3.0257362
H  -1.94411028 -1.28768574 -2.60769775
C  1.26827263 -1.21610795 -3.89710553
H  1.39191226 -2.30676725 -3.8295456
H  1.04345488 -0.96368779 -4.9440093
H  2.22052031 -0.74651041 -3.61960778
C  1.10900639 1.60104921 -3.2523031
H  1.42767879 1.52989643 -4.3016947
H  0.88749056 2.65471935 -3.02944368
H  1.94353807 1.28413324 -2.60987262
