program: Gaussian 16
title: Title
version: ES64L-G16RevA.03
method: RPBE1PBE
basis: def2SVP
operation: Freq
keyword: #N
keyword: Geom=AllCheck
keyword: Guess=TCheck
keyword: SCRF=Check
keyword: GenChk
keyword: RPBE1PBE/def2SVP
keyword: Freq
converged: YES YES NO YES
title: Mulliken charges:
elementType: C C C C B B O O O O C H H H C H H H C H H H C H H H C H H H C H H H C H H H C H H H S O C C H H H H H H
charge: -0.131186 -0.131767 -0.093695 -0.098821 0.222027 0.053625 -0.366519 -0.357814 -0.310337 -0.288829 0.032078 0.030878 0.035556 0.029798 0.005053 0.030139 0.037409 0.043735 0.031309 0.032019 0.035404 0.031107 0.014450 0.031614 0.028814 0.038106 0.020530 0.047191 0.047751 0.045924 0.029799 0.050964 0.048515 0.041914 0.020476 0.046831 0.048592 0.049170 0.032911 0.049473 0.045111 0.042027 0.375754 -0.491101 -0.127207 -0.130003 0.120273 0.123583 0.113509 0.117295 0.122761 0.123810
chargesum: -0.00000
title: Mulliken charges with hydrogens summed into heavy atoms:
elementType: C C C C B B O O O O C C C C C C C C S O C C
charge: -0.131186 -0.131767 -0.093695 -0.098821 0.222027 0.053625 -0.366519 -0.357814 -0.310337 -0.288829 0.128310 0.116336 0.129838 0.112984 0.161396 0.171191 0.165068 0.169521 0.375754 -0.491101 0.236659 0.227361
chargesum: 0.00000
1716.lowfreq: -10.2327 -7.1545 -0.0008 0.0004 0.0023 9.2966 12.6784 31.5745 43.2568
frequency: 9.8252 31.5420 43.1831 53.2409 58.5010 81.4565 102.9596 114.6499 126.0258 152.2983 187.4262 191.0731 197.7690 205.5749 219.8095 232.1769 239.9388 241.0913 251.1268 258.0569 285.3506 287.8297 298.6295 305.3914 309.1858 313.5220 318.3146 321.7076 324.6091 349.5835 358.6782 363.1780 368.8349 370.9005 393.0637 403.8092 428.8347 433.6929 490.7037 505.5734 513.8307 532.5697 538.9727 588.1793 593.2493 630.2000 670.6036 683.6394 691.6000 711.6729 747.0972 751.0458 823.5633 873.0536 884.5680 888.6721 900.3999 912.1721 924.9342 927.3217 936.0642 937.0779 937.7684 952.5358 969.6352 971.7436 978.9032 987.3075 991.3846 997.1949 1002.2402 1006.2920 1011.4161 1045.5180 1061.5360 1098.1407 1129.8609 1178.9554 1179.8351 1193.1127 1200.5786 1201.7183 1248.7215 1254.2454 1262.8576 1278.3130 1288.0526 1300.5147 1305.0978 1308.4192 1327.0471 1357.0426 1366.3709 1372.6089 1379.1816 1380.6600 1385.6551 1386.7843 1388.2870 1396.2717 1402.5536 1412.0035 1419.0394 1434.1523 1436.2305 1439.3132 1440.1495 1442.1462 1444.1353 1444.2265 1447.6971 1448.7224 1458.8951 1459.6048 1462.1301 1465.2131 1466.3718 1467.8568 1478.8765 1481.2313 3053.7776 3054.8652 3057.6062 3060.2803 3061.6596 3062.3851 3066.7326 3068.7030 3076.9480 3079.6148 3144.6649 3147.2360 3149.4464 3153.3592 3158.0101 3159.3901 3162.0373 3163.4052 3163.5771 3169.2698 3170.0385 3171.2769 3171.4559 3176.5266 3180.1873 3181.1007 3211.8312 3213.4617 3221.4222 3222.5183
redmass: 3.6360 3.7573 3.7659 3.6587 3.9360 3.0467 3.5399 4.2107 4.2230 3.5699 3.9933 1.9229 1.3991 2.8414 1.4193 1.2339 1.1776 1.2105 1.1595 1.6460 2.4981 2.3076 2.0149 2.3539 1.9216 1.1966 1.1537 1.0867 1.1871 2.7752 2.5726 2.4292 2.3163 2.3946 2.5349 2.8373 3.4353 3.8541 2.7065 4.6319 2.7807 3.3355 3.9585 3.8419 3.8886 6.7126 6.2112 3.2167 3.5699 4.6530 7.1241 4.5512 7.1778 3.3816 2.5355 2.5386 2.2259 1.2029 1.4570 1.4389 1.8293 1.7880 2.0716 1.3719 1.7064 1.6936 1.7558 1.6423 1.4464 1.3372 1.3802 1.5238 1.5742 1.3922 7.1600 8.5443 2.8137 2.6676 2.5171 2.7396 3.2164 3.2319 2.9349 3.0336 2.5711 2.4767 3.9347 2.8022 1.5778 2.3239 1.2118 6.1133 1.3635 1.5212 1.3480 1.4170 1.5638 1.4371 1.3785 1.3936 1.0492 1.0418 1.0474 1.0584 1.0558 1.0497 1.0474 1.0519 1.0626 1.0609 1.0567 1.0591 1.0522 1.0500 1.0816 1.0638 1.0657 1.0976 1.0671 1.0717 1.0363 1.0373 1.0377 1.0379 1.0365 1.0366 1.0379 1.0380 1.0292 1.0298 1.1041 1.1039 1.1032 1.1036 1.1044 1.1044 1.1043 1.1044 1.1047 1.1047 1.1043 1.1035 1.1034 1.1035 1.1036 1.1036 1.1095 1.1097 1.1099 1.1090
irintensity: 0.2377 1.4545 2.3380 6.6176 7.6699 2.8562 0.7791 3.1695 3.6614 0.9274 1.2132 2.3627 0.4177 0.6354 0.3939 0.3465 0.6808 0.1702 0.1368 0.8047 0.6951 0.6282 0.8841 0.9641 1.6369 0.2591 1.4098 0.4441 0.6424 6.2459 8.6863 5.9475 0.7245 0.8771 1.9222 0.8313 7.9478 5.8410 8.1660 41.0439 45.9744 1.7670 13.3340 0.9965 3.2025 333.1059 220.3004 19.4218 76.7417 13.6092 5.6519 24.2732 82.3409 2.8735 21.6002 20.0802 54.6699 13.6110 7.7146 1.9296 50.5989 42.2450 64.1701 19.5212 7.3629 12.0002 0.1212 11.8834 2.4918 0.4959 6.3200 50.2957 29.1505 86.4057 209.0045 916.5142 24.2480 116.5243 102.1700 45.8427 167.9927 146.0635 40.2410 5.0814 1.0657 0.6165 224.0364 28.5631 12.2114 21.7919 4.6767 69.1232 57.8369 3.8041 49.4027 24.0570 1.1561 31.2757 27.3020 15.4710 14.6542 12.6941 7.8259 0.6037 0.0823 10.4289 34.6883 2.9851 0.9615 6.9448 7.5289 8.0340 2.3331 6.1824 3.5705 4.8302 2.7537 4.3699 6.7265 7.4549 13.8182 31.5330 36.3810 35.3843 7.6786 25.5229 19.9987 17.8927 6.0576 0.2214 4.7661 16.3116 70.1243 47.4406 7.2699 6.8189 15.8321 50.3649 24.5161 4.5421 44.8636 8.0754 39.6510 21.2563 16.9879 21.5978 1.6626 1.6317 10.4649 12.9602
temp: 298.150 k
press: 1.00000 atm
elementType: 6 6 6 6 5 5 8 8 8 8 6 1 1 1 6 1 1 1 6 1 1 1 6 1 1 1 6 1 1 1 6 1 1 1 6 1 1 1 6 1 1 1 16 8 6 6 1 1 1 1 1 1
symmnumber: 1
zpe: 1166686.5 jmol-1
zpe.correction: 0.444367 hartree
zpe.thermalcorrener: 0.470593 hartree
zpe.thermalcorrenthalpy: 0.471537 hartree
zpe.thermalcorrgfe: 0.389265 hartree
zpe.sumelectzpe: -1373.259741 hartree
zpe.sumelectthermal: -1373.233516 hartree
zpe.sumelectthermalent: -1373.232572 hartree
zpe.sumelectthermalfe: -1373.314844 hartree
dipole: -3.6532 8.8767 -1.9080
dipole: 9.7868
quadrupole: -124.2727 -109.0467 -146.6331
quadrupole: 3.1233 -3.2787 -3.4093
quadrupole: 2.3781 17.6041 -19.9822 3.1233 -3.2787 -3.4093
hfenergy: -1373.7041087 hartree
pointgroup: C01 [X(C14H30B2O5S1)]
dipole: -1.8148141 3.3839885 -0.2845008 debye
polarizability: 280.1046553|-5.3479216|276.0400475|-9.3451437|-0.2548268|240.5718915 unknown
InChI: InChI=1/14C.2B.5O.S.30H
charge 0 multiplicity 1
52 atoms
C  -2.74879659 -1.48967792 -0.56040535
C  -3.067708 -0.64039819 0.71316121
C  2.74908931 -1.28509527 0.50128363
C  2.87734863 -0.31743226 -0.722629
B  0.82456527 -0.01082251 0.30312726
B  -0.83674171 -0.49023761 0.19697673
O  1.52069017 0.03480319 -0.95807256
O  1.66368169 -0.7291556 1.2259819
O  -1.8749534 0.15680279 0.84349941
O  -1.31127473 -1.56400393 -0.52270958
C  3.44580016 -0.9578101 -1.97904588
H  3.50809884 -0.20797202 -2.78268957
H  4.45969123 -1.34902183 -1.80216997
H  2.8089247 -1.77941994 -2.33238667
C  3.68168969 0.93900229 -0.38664072
H  4.75591859 0.72480398 -0.28319526
H  3.55982542 1.66451344 -1.20587878
H  3.31907058 1.40417947 0.53970105
C  3.97632418 -1.34060824 1.39596954
H  3.80274158 -2.0458605 2.22319547
H  4.86007921 -1.6853762 0.83704614
H  4.19761055 -0.35692348 1.83098768
C  2.35633052 -2.69944634 0.07152925
H  3.18052302 -3.23226297 -0.42560641
H  2.06611569 -3.27075775 0.96618938
H  1.49189865 -2.66753938 -0.60754648
C  -3.11885181 -0.77420018 -1.85496295
H  -2.67307212 -1.31808117 -2.70038607
H  -4.20731902 -0.73518687 -2.00380339
H  -2.72486661 0.25286131 -1.86516794
C  -4.26873054 0.27708512 0.58645516
H  -5.18269755 -0.30237195 0.38755901
H  -4.41563426 0.82864482 1.5269282
H  -4.13510838 1.00887437 -0.22068171
C  -3.17710331 -1.48401423 1.97756318
H  -3.18135765 -0.81639239 2.85140986
H  -4.10260023 -2.07708814 1.99201498
H  -2.32040839 -2.16700659 2.07344899
C  -3.32276771 -2.8932301 -0.55222253
H  -4.42128811 -2.86481237 -0.49607004
H  -3.04371411 -3.41244068 -1.48090415
H  -2.9429989 -3.4807195 0.29359334
S  -0.07261454 2.49405697 0.07422536
O  0.80383591 1.51025673 0.93187086
C  1.06000312 3.82872831 -0.27333715
C  -1.12937122 3.24633666 1.29792797
H  -1.70205498 4.05221218 0.81913383
H  -1.79707974 2.44036493 1.62745164
H  -0.5136716 3.62525237 2.12425296
H  1.52555467 4.16534416 0.662292
H  1.81314598 3.42439561 -0.96091778
H  0.50227283 4.64053454 -0.75996408
