program: Gaussian 16
title: Title
version: ES64L-G16RevA.03
method: RPBE1PBE
basis: def2SVP
operation: Freq
keyword: #N
keyword: Geom=AllCheck
keyword: Guess=TCheck
keyword: SCRF=Check
keyword: GenChk
keyword: RPBE1PBE/def2SVP
keyword: Freq
converged: YES YES NO YES
title: Mulliken charges:
elementType: C C C C B B O O O O C H H H C H H H C H H H C H H H C H H H C H H H C H H H C H H H S O C C H H H H H H
charge: -0.136707 -0.136656 -0.096500 -0.123544 0.197674 0.092427 -0.320605 -0.341065 -0.303946 -0.280965 0.037188 0.035269 0.038975 0.031615 0.025781 0.031238 0.029288 0.040425 0.032756 0.034925 0.039030 0.033170 0.018429 0.036013 0.034399 0.038830 0.023394 0.047273 0.047860 0.041015 0.037426 0.050805 0.045921 0.039309 0.020932 0.047874 0.049064 0.048992 0.035266 0.050123 0.045864 0.041998 0.403450 -0.570130 -0.141309 -0.134814 0.114044 0.113484 0.102778 0.112607 0.121607 0.117724
chargesum: 0.00000
title: Mulliken charges with hydrogens summed into heavy atoms:
elementType: C C C C B B O O O O C C C C C C C C S O C C
charge: -0.136707 -0.136656 -0.096500 -0.123544 0.197674 0.092427 -0.320605 -0.341065 -0.303946 -0.280965 0.143047 0.126732 0.139880 0.127671 0.159541 0.173462 0.166862 0.173251 0.403450 -0.570130 0.210629 0.195492
1716.lowfreq: -119.8589 -5.6706 -3.3379 -0.0020 -0.0018 -0.0017 9.9975 14.3141 21.5089
frequency: -119.8577 12.7154 21.4055 41.8099 47.6799 59.0933 71.8141 81.0507 104.0929 122.1869 143.6174 175.2681 189.5254 191.6881 219.6012 228.4582 237.7884 241.1077 249.6703 257.9192 287.4847 290.8541 299.4753 301.7020 309.4408 314.0656 318.1857 325.3304 327.4778 342.1625 353.7195 358.5050 369.3560 373.0180 381.1599 387.0631 396.1962 426.9474 456.3148 474.1058 519.6134 532.0722 532.9538 544.3325 591.2292 592.5225 660.7490 682.4647 688.5691 696.8680 740.9470 755.7045 832.8819 867.8952 884.5877 888.8827 901.6703 906.3581 928.3099 931.8968 937.1778 937.8980 945.3765 956.4880 970.8848 976.1767 980.9553 989.4291 994.2121 997.6933 1003.3849 1005.6464 1012.5186 1037.5285 1108.5555 1130.5530 1134.4486 1179.6003 1184.8871 1193.7120 1194.3823 1224.3822 1248.0597 1253.0118 1268.9897 1278.9726 1298.8294 1300.6015 1306.2938 1312.0587 1324.4352 1372.2943 1377.6872 1380.3298 1382.9302 1385.5986 1387.1616 1388.2762 1391.6531 1399.6254 1403.4372 1409.5160 1415.9511 1429.9056 1434.4129 1436.3189 1441.2464 1441.9627 1443.4390 1444.2805 1446.9381 1449.8342 1459.8203 1460.7770 1463.5552 1465.4156 1466.4874 1468.3590 1480.9893 1482.4666 3056.1162 3058.6462 3060.4801 3062.3005 3062.7675 3063.6341 3067.6362 3069.4844 3073.8987 3076.6521 3148.7961 3150.4801 3154.4076 3156.7493 3159.4481 3160.3912 3161.8971 3163.3993 3164.2921 3169.7355 3170.6408 3175.1435 3175.6336 3181.8451 3182.0493 3183.7282 3206.0816 3210.8215 3215.7057 3225.0678
redmass: 6.9821 3.8337 3.5369 4.0879 3.5715 3.1376 3.4755 4.3832 3.5915 4.2879 4.3648 3.3547 1.4338 1.9728 2.3915 1.1117 1.2511 1.2396 1.1790 1.1622 2.0319 2.4648 1.9922 2.3028 2.1603 1.1703 1.1557 1.1099 1.1838 2.4277 3.1341 2.4967 2.4010 2.1162 2.5033 3.8361 2.6218 2.9324 3.8312 2.9491 3.1354 3.2880 3.2045 4.0328 3.8732 3.8412 9.5164 3.1620 3.2236 4.4554 4.1431 9.1019 7.4237 3.2850 2.3528 2.9483 2.2052 1.1931 1.4382 1.4505 1.4680 1.4149 1.6403 2.2466 1.6724 1.6806 1.7254 1.6796 1.3772 1.3362 1.7642 1.4448 1.6910 1.3741 4.8953 4.6643 3.4846 2.7128 2.7120 2.7655 3.0082 3.9459 2.9216 3.0911 2.5613 2.4747 2.9602 1.3538 2.9771 3.7565 1.2172 1.3496 1.5663 1.3506 1.3885 1.7383 1.5057 1.3695 1.5908 1.9720 1.2166 1.0515 1.0492 1.0465 1.0597 1.0601 1.0523 1.0539 1.0609 1.0583 1.0597 1.0596 1.0487 1.0494 1.0699 1.0649 1.0822 1.1043 1.0655 1.0694 1.0364 1.0373 1.0379 1.0364 1.0366 1.0380 1.0379 1.0380 1.0295 1.0297 1.1045 1.1039 1.1034 1.1040 1.1047 1.1043 1.1044 1.1044 1.1043 1.1047 1.1044 1.1033 1.1033 1.1037 1.1036 1.1038 1.1098 1.1098 1.1090 1.1088
irintensity: 139.6311 7.2679 0.4245 8.1511 2.6278 3.9470 10.2824 2.7299 0.8039 5.4471 1.1906 2.4012 0.6532 0.4098 0.2793 3.5024 0.4578 0.4030 0.2861 0.3978 1.2309 1.7001 2.2856 1.4721 20.4517 0.4953 8.5215 5.1677 3.6943 29.4449 39.6418 1.5324 9.0365 0.3169 41.3303 76.1984 10.7345 7.7539 7.1426 40.3800 66.0701 3.3415 0.7466 175.6223 0.4444 9.9273 24.0074 3.7237 3.1085 3.3762 11.6629 27.8064 37.4941 7.5397 43.3909 7.6001 27.6353 9.4170 1.1973 4.9242 0.7531 0.3994 33.0741 136.7330 14.5803 7.1085 4.9989 7.5097 4.4929 1.9142 143.6179 49.3933 49.3145 53.0903 246.7998 605.3564 418.9647 51.4880 65.8714 63.8913 119.7134 335.6524 28.7167 2.5433 5.6353 0.3892 4.9903 49.6579 11.1633 146.9945 5.5518 42.4779 3.0693 49.1452 22.7146 6.6377 11.8318 29.3691 57.4136 9.4580 20.7554 11.4968 12.7737 44.7383 1.1997 0.1268 2.5253 3.5033 0.7079 1.0958 8.0703 6.2429 3.1139 5.6228 3.9105 4.8164 4.7513 2.9256 9.0856 7.6116 16.8924 23.7516 28.1415 1.4955 29.1905 38.8169 19.8959 18.8715 4.1602 0.6802 5.3435 14.0636 59.5183 35.1795 3.0321 8.9725 36.5303 8.8078 52.1764 5.2101 36.2371 18.1768 29.8796 10.9517 27.5534 12.2409 0.8233 0.3946 1.4106 11.4700
temp: 298.150 k
press: 1.00000 atm
elementType: 6 6 6 6 5 5 8 8 8 8 6 1 1 1 6 1 1 1 6 1 1 1 6 1 1 1 6 1 1 1 6 1 1 1 6 1 1 1 6 1 1 1 16 8 6 6 1 1 1 1 1 1
symmnumber: 1
zpe: 1164775.8 jmol-1
zpe.correction: 0.443640 hartree
zpe.thermalcorrener: 0.469653 hartree
zpe.thermalcorrenthalpy: 0.470597 hartree
zpe.thermalcorrgfe: 0.388159 hartree
zpe.sumelectzpe: -1373.255174 hartree
zpe.sumelectthermal: -1373.229161 hartree
zpe.sumelectthermalent: -1373.228216 hartree
zpe.sumelectthermalfe: -1373.310654 hartree
dipole: -3.9520 7.4167 2.6811
dipole: 8.8212
quadrupole: -124.6633 -113.5581 -145.5911
quadrupole: -0.9361 1.1949 -1.1951
quadrupole: 3.2742 14.3794 -17.6536 -0.9361 1.1949 -1.1951
hfenergy: -1373.6988134 hartree
pointgroup: C01 [X(C14H30B2O5S1)]
dipole: -1.556225 2.916779 1.0560514 debye
polarizability: 273.5971419|-5.72788|272.4737002|-2.8871271|-1.9344292|255.3223775 unknown
InChI: InChI=1/14C.2B.5O.S.30H
charge 0 multiplicity 1
52 atoms
C  -3.00028753 -0.94915159 -0.79397898
C  -2.94674182 -0.68203741 0.74792262
C  2.82651062 -0.88073346 0.80637593
C  3.00591973 -0.82661438 -0.75168751
B  0.84546014 -0.26646941 -0.2121254
B  -0.84130619 -0.58195589 -0.14838177
O  1.65409957 -0.83833631 -1.21152951
O  1.5705398 -0.23916855 1.00628216
O  -1.61105662 -0.17030556 0.91884773
O  -1.61314338 -1.18169135 -1.11370051
C  3.73372782 -2.02237894 -1.34435229
H  3.81984834 -1.90001756 -2.43467763
H  4.75072603 -2.10923188 -0.93244707
H  3.19528912 -2.95919202 -1.15033602
C  3.67721442 0.46102736 -1.22559352
H  4.74560797 0.48322916 -0.96483363
H  3.59073239 0.51925881 -2.32125126
H  3.17839172 1.34173503 -0.80122457
C  3.8996685 -0.14454842 1.59088987
H  3.69569578 -0.23128224 2.66896617
H  4.89558761 -0.5726674 1.39920276
H  3.92149639 0.9226659 1.33431749
C  2.69418413 -2.30993694 1.33004895
H  3.64556716 -2.86043689 1.28947186
H  2.36200021 -2.27105024 2.37817523
H  1.94029687 -2.86800965 0.7554496
C  -3.43654762 0.27382278 -1.59303988
H  -3.24731727 0.08610135 -2.65992196
H  -4.50794718 0.4828471 -1.46358451
H  -2.86479514 1.16527458 -1.29623254
C  -3.93792559 0.3503132 1.25057192
H  -4.97098918 0.03310056 1.04417553
H  -3.82965747 0.46848617 2.33878534
H  -3.77001741 1.32919593 0.78335906
C  -3.04173902 -1.95602721 1.57844724
H  -2.78670968 -1.71991826 2.62176474
H  -4.05603989 -2.37941753 1.55870651
H  -2.33564769 -2.71879229 1.21897181
C  -3.81522956 -2.16102823 -1.20241891
H  -4.86521968 -2.04437157 -0.89515778
H  -3.79194186 -2.27112569 -2.29652379
H  -3.42033803 -3.08372712 -0.75826658
S  -0.33724289 2.43167267 -0.14208668
O  0.80618033 1.53261033 -0.69181466
C  0.17306246 4.05623063 -0.68549275
C  -0.03716996 2.58231257 1.61824938
H  -0.74554136 3.31684879 2.02615335
H  -0.23096534 1.58821546 2.03830021
H  1.00512232 2.88621813 1.78174362
H  1.19901215 4.24424676 -0.34182153
H  0.12568122 4.04843329 -1.78179874
H  -0.52838544 4.79974546 -0.28320309
