program: Gaussian 16
title: Title
version: ES64L-G16RevA.03
frameworkgroup: C1[X(C7H9F3O3S)]
method: RPBE1PBE
basis: def2SVP
operation: Freq
keyword: #N
keyword: Geom=AllCheck
keyword: Guess=TCheck
keyword: SCRF=Check
keyword: GenChk
keyword: RPBE1PBE/def2SVPFreq
converged: YES YES NO YES
title: Mulliken charges:
elementType: C C C C C C H H H H H H H H O S O O C F F F H
charge: 0.006482 -0.078757 -0.014797 0.063645 -0.083990 -0.076296 0.044054 0.065317 0.067802 0.055632 0.047527 0.051464 0.049392 0.048174 -0.431717 0.896299 -0.435222 -0.436719 0.527312 -0.142029 -0.140553 -0.141089 0.058070
chargesum: -0.00000
title: Mulliken charges with hydrogens summed into heavy atoms:
elementType: C C C C C C O S O O C F F F
charge: 0.129869 -0.034703 -0.014797 0.187079 0.015001 0.021270 -0.431717 0.896299 -0.435222 -0.436719 0.527312 -0.142029 -0.140553 -0.141089
chargesum: 0.00000
1716.lowfreq: -4.7274 -3.0395 0.0014 0.0016 0.0020 5.8287 16.3527 37.7352 63.3104
frequency: 15.2274 37.6759 63.3101 84.1455 157.6492 172.6031 193.8164 250.3747 270.6215 287.6779 316.5780 323.9611 372.7021 407.0210 436.4819 475.8333 512.3397 534.4894 566.1395 580.6842 595.3801 635.0949 769.4287 799.6701 814.2929 837.4973 878.3906 894.6831 931.0233 957.7183 996.3230 1064.5628 1088.5348 1096.9493 1125.2696 1146.5064 1151.6530 1208.6485 1253.7065 1255.3062 1275.7271 1277.4251 1281.1193 1305.1454 1362.9919 1377.9767 1382.7738 1400.2550 1416.4668 1429.7378 1436.1518 1451.3681 1461.6566 1778.5836 3044.1387 3051.5646 3058.7884 3064.0900 3104.2940 3124.4397 3127.0589 3131.4074 3213.8361
redmass: 6.9416 8.1806 4.6160 4.2395 8.1720 3.3940 9.5255 2.3663 9.6135 10.1059 3.0606 3.8200 11.5338 6.1692 2.5773 4.4204 4.3578 5.8610 12.4737 13.5886 11.2161 3.0059 5.2350 4.1570 1.4563 5.0192 1.6490 2.4835 1.3578 2.0663 2.9451 1.5727 1.9702 1.3070 3.5311 3.0133 1.7012 1.4909 1.3365 10.8394 11.2144 10.8544 1.1753 1.3319 1.5134 1.8050 1.6910 2.2280 8.4625 1.1189 1.1594 1.1144 1.1146 8.1894 1.0685 1.0690 1.0682 1.0640 1.0972 1.0971 1.1011 1.1042 1.0937
irintensity: 0.1999 0.2985 0.1088 0.6001 6.9153 2.2225 3.9251 1.4861 2.9526 4.9764 1.2853 2.1500 3.1208 3.9453 9.6225 43.6634 12.7623 27.5627 5.2383 83.7017 130.8599 34.6269 100.2638 8.0800 17.3780 171.8005 51.4696 111.8728 13.4438 18.7755 17.2224 46.2381 14.3598 6.8677 274.5286 274.0918 101.6788 4.2900 0.9043 56.0412 315.2724 389.5490 19.9489 23.1155 2.2830 0.5392 0.7400 60.2129 363.0002 4.5729 42.3557 8.1160 5.5312 23.9957 27.3670 20.3266 24.9147 46.6648 25.7147 6.8070 39.0760 37.2197 5.2196
temp: 298.150 k
press: 1.00000 atm
elementType: 6 6 6 6 6 6 1 1 1 1 1 1 1 1 8 16 8 8 6 9 9 9 1
symmnumber: 1
zpe: 437336.6 jmol-1
zpe.correction: 0.166573 hartree
zpe.thermalcorrener: 0.179803 hartree
zpe.thermalcorrenthalpy: 0.180748 hartree
zpe.thermalcorrgfe: 0.124612 hartree
zpe.sumelectzpe: -1193.633568 hartree
zpe.sumelectthermal: -1193.620338 hartree
zpe.sumelectthermalent: -1193.619393 hartree
zpe.sumelectthermalfe: -1193.675529 hartree
dipole: -3.9361 2.7355 0.1076
dipole: 4.7945
quadrupole: -81.5706 -86.0223 -90.6151
quadrupole: 4.5060 1.7285 -0.3409
quadrupole: 4.4987 0.0470 -4.5458 4.5060 1.7285 -0.3409
hfenergy: -1193.800141 hartree
pointgroup: C01 [X(C7H9F3O3S1)]
dipole: -1.5418744 1.0858555 0.0406574 debye
dipolederiv: 0.0757067 -0.0026638 0.0504706 0.0792452 -0.0148803 0.0271387 0.0858182 -0.0557199 0.1392976 -0.049412 -0.1724598 -0.1235586 -0.0561692 -0.0824634 -0.0012612 -0.0880039 0.1052601 -0.1494285 1.2782115 -0.1975929 -0.1751861 -0.1332819 0.6313474 -0.053938 -0.5552046 0.1428725 -0.050622 -0.0997942 0.036327 0.0477994 0.0155968 -0.1514828 0.1065369 0.113634 -0.0402906 0.1751717 0.1307966 0.016636 -0.0088418 -0.0373474 0.0589281 0.0146811 -0.0303027 0.0065116 0.1452891 0.0938629 0.0315698 0.0058709 0.0502642 0.0509521 0.0111577 0.0198817 0.0229588 0.1341466 -0.0155538 -0.072929 0.0697427 -0.0665287 0.06717 0.0201619 0.0704724 0.0346586 0.1512979 -0.0367082 0.0612976 -0.012707 -0.0226975 0.034457 -0.067951 0.0186163 -0.1526868 -0.0798746 0.0550294 -0.1165541 -0.0026453 -0.0191234 -0.0179321 -0.0638377 -0.010605 -0.0895794 -0.0761993 0.0395154 0.0624686 -0.032515 0.0734533 0.0013308 0.0271746 -0.0193571 0.0875584 0.0542337 -0.070775 -0.1080874 0.0402228 -0.1064268 -0.0873552 0.0414323 0.028092 0.0187339 0.0771891 0.0161309 0.0196683 -0.0751286 0.0253994 0.0374488 -0.0725945 -0.0247783 -0.0264308 -0.1558254 0.0401968 -0.0223159 -0.0386531 -0.0501782 0.0040046 -0.0405282 -0.1018471 -0.028423 -0.1520354 -0.1421579 0.0644506 0.0753633 0.063039 0.0226114 -0.020875 0.1128564 -0.0229905 0.0376385 -2.2995144 0.4643988 -0.1147517 0.3971828 -0.7818695 0.0572146 -0.146348 -0.0820086 -0.6966189 3.1866611 -0.5135981 -0.1110721 -0.5149637 2.1837137 -0.0577511 0.2863685 -0.2092053 2.432846 -1.1217111 0.3509734 0.2229794 0.2689471 -0.9946386 -0.1838851 0.2891894 -0.282536 -0.8407205 -0.9279836 -0.0715958 0.1771282 -0.0622699 -0.8606316 0.1634929 0.0135972 0.3964343 -1.0989792 2.0005202 0.1005834 0.046843 0.2786413 1.775277 0.0034073 0.0603926 0.0257663 1.8169007 -0.3970347 -0.1237379 0.0611997 -0.1888708 -0.7144066 0.3680336 0.090816 0.3600625 -0.8177486 -1.1776012 -0.0296657 -0.3042507 -0.1405834 -0.3926805 -0.025797 -0.3664288 -0.0104321 -0.4284682 -0.5575588 0.1409246 0.2162865 0.1173485 -0.7108896 -0.3436943 0.1906228 -0.3350509 -0.6371821 -0.0208266 0.0819024 -0.0145966 0.0293233 -0.0580107 0.0916815 -0.0374819 0.1345366 0.0196918 unknown
polarizability: 134.8706062|-11.7657128|131.8233598|-4.0749839|-1.3059903|100.9250531 unknown
InChI: InChI=1/7C.3F.3O.S.9H
charge 0 multiplicity 1
23 atoms
C  -3.00406804 1.58697919 -0.12401968
C  -1.64012131 1.13129843 -0.54005221
C  -1.30512282 -0.15951011 -0.54889008
C  -2.18849273 -1.29797237 -0.16528836
C  -3.41412063 -0.79157721 0.58987539
C  -4.00872566 0.43953258 -0.0830878
H  -0.90374189 1.87582404 -0.85433931
H  -2.92690828 2.07029854 0.8676774
H  -2.48156844 -1.84340466 -1.08081328
H  -1.61630682 -2.01047868 0.44846325
H  -4.16114707 -1.59556273 0.66546025
H  -3.11836137 -0.53486114 1.62163929
H  -4.30476286 0.18005749 -1.11438422
H  -4.92444277 0.76042462 0.43606581
O  -0.04014678 -0.52303754 -1.06408037
S  1.16664422 -0.88933418 -0.06770883
O  2.12912436 -1.61769538 -0.85594762
O  0.67549202 -1.35957408 1.20921175
C  1.88883572 0.80382733 0.22618934
F  1.96111458 1.46205581 -0.91268862
F  3.09622223 0.64827553 0.7289253
F  1.13269523 1.4668472 1.0775422
H  -3.34614366 2.38045078 -0.80822224
