program: Gaussian 16
title: Title
version: ES64L-G16RevA.03
frameworkgroup: C1[X(C17H14O)]
method: RPBE1PBE
basis: def2SVP
operation: Freq
keyword: #N
keyword: Geom=AllCheck
keyword: Guess=TCheck
keyword: SCRF=Check
keyword: GenChk
keyword: RPBE1PBE/def2SVP
keyword: Freq
converged: YES YES YES YES
title: Mulliken charges:
elementType: C C C C C C H H H H C C C C H C H C H H C O C C H H C C H H H H
charge: -0.026842 -0.030516 -0.002234 -0.037637 -0.025644 -0.020138 0.042133 0.036725 0.037349 0.043453 -0.002234 -0.030516 -0.037637 -0.026842 0.036725 -0.025644 0.037349 -0.020138 0.042133 0.043453 0.155684 -0.300880 0.039683 -0.111218 0.032509 0.048879 -0.111218 0.039683 0.048879 0.032509 0.046097 0.046097
chargesum: -0.00000
title: Mulliken charges with hydrogens summed into heavy atoms:
elementType: C C C C C C C C C C C C C O C C C C
charge: 0.015291 0.006209 -0.002234 -0.000288 0.017809 0.025959 -0.002234 0.006209 -0.000288 0.015291 0.017809 0.025959 0.155684 -0.300880 0.072192 -0.062340 -0.062340 0.072192
chargesum: 0.00000
1716.lowfreq: -3.8893 -0.0006 0.0005 0.0007 3.6662 4.0775 21.1730 24.9887 40.3537
frequency: 21.1719 24.9550 40.3537 80.7354 80.8624 105.4066 114.1184 186.1336 187.3104 246.2945 279.3547 285.1737 289.9373 417.0034 417.0162 419.5094 500.2070 511.0128 531.3060 564.5753 596.9000 628.7957 629.5848 698.0592 712.1580 721.9700 748.0837 776.9385 804.4904 856.2622 864.4990 865.1876 882.8987 885.3981 932.4839 958.6562 961.0865 1006.7156 1012.8811 1012.9439 1014.8726 1015.3102 1029.1504 1033.1404 1039.1018 1043.3255 1058.2229 1059.3934 1105.2896 1107.8872 1129.3508 1167.1913 1167.2625 1187.4631 1187.7152 1226.7131 1226.7694 1308.6971 1310.2213 1328.8445 1335.6311 1340.2466 1371.6043 1403.5902 1407.0627 1487.8335 1488.6000 1536.4762 1537.7503 1654.2302 1654.5716 1676.2957 1684.0523 1687.8083 1700.9100 1777.1874 3180.2911 3180.9988 3203.7230 3206.2671 3206.2966 3211.0333 3211.9495 3212.7553 3219.6368 3219.7627 3226.8109 3226.8551 3233.5096 3233.5751
redmass: 4.8891 3.5788 5.4036 3.8394 4.7628 4.5137 4.8059 2.5215 6.6417 5.1120 9.0358 3.1366 3.0013 2.8052 2.8080 4.6052 2.6751 2.8393 4.1726 7.2274 6.4099 6.3770 6.3393 3.1556 1.6548 1.4741 6.5545 1.7341 2.5043 4.7364 1.2810 1.2620 3.6453 1.6905 1.9647 1.4462 1.5100 4.2944 1.3808 1.3823 5.3600 5.1840 1.2398 1.2957 1.3024 1.2503 2.1012 2.0649 1.4333 1.4505 1.9486 1.0676 1.0684 1.1188 1.1095 1.3861 1.5948 1.6756 2.0906 1.5303 1.3767 1.3063 2.8952 6.9824 6.2071 2.5496 2.5633 2.6130 2.6633 6.2177 6.1026 7.5676 6.3453 6.9335 6.1246 8.2826 1.0896 1.0900 1.0925 1.0875 1.0876 1.0910 1.0891 1.0906 1.0927 1.0927 1.0968 1.0967 1.1010 1.1010
irintensity: 0.8415 0.0000 0.4117 2.7437 0.0000 0.0850 0.8418 0.0000 0.0001 1.5126 7.8596 0.0000 2.3597 0.0000 0.0200 14.6076 23.9549 0.0000 6.6022 130.2729 1.3908 0.9001 0.2097 17.0162 0.0000 109.8918 15.9065 0.0000 68.0366 0.0740 0.0000 0.2505 5.8936 0.0000 45.5701 0.0000 1.8217 0.1105 0.0000 0.1143 8.2807 0.0845 0.0000 18.1014 0.0000 47.8495 1.0367 2.3996 64.1313 25.2052 559.9551 0.0283 3.9109 78.8655 1.2046 1.5836 212.4828 12.1730 0.6570 1.2478 10.2350 3.5074 349.1000 0.7621 166.1154 41.9677 53.3940 1.1737 76.9851 8.0431 131.6131 187.3946 122.7304 41.6703 1486.7706 138.9350 0.2474 3.4210 4.3501 4.2287 2.4954 3.5504 0.1846 8.2901 0.6910 7.0870 13.0082 25.1357 28.6340 5.4458
temp: 298.150 k
press: 1.00000 atm
elementType: 6 6 6 6 6 6 1 1 1 1 6 6 6 6 1 6 1 6 1 1 6 8 6 6 1 1 6 6 1 1 1 1
symmnumber: 1
zpe: 683795.4 jmol-1
zpe.correction: 0.260444 hartree
zpe.thermalcorrener: 0.275680 hartree
zpe.thermalcorrenthalpy: 0.276624 hartree
zpe.thermalcorrgfe: 0.214873 hartree
zpe.sumelectzpe: -729.840194 hartree
zpe.sumelectthermal: -729.824957 hartree
zpe.sumelectthermalent: -729.824013 hartree
zpe.sumelectthermalfe: -729.885765 hartree
dipole: -0.0000 -3.9607 0.0000
dipole: 3.9607
quadrupole: -65.7374 -98.8353 -112.3870
quadrupole: -0.0000 -0.0001 -0.0002
quadrupole: 26.5825 -6.5154 -20.0671 -0.0000 -0.0001 -0.0002
hfenergy: -730.1006375 hartree
pointgroup: C01 [X(C17H14O1)]
dipole: -0.0000001 -1.5582507 0.0000036 debye
polarizability: 544.1458208|-0.0000091|259.2087451|-0.0006542|-0.001042|98.1987431 unknown
InChI: InChI=1/17C.O.14H
charge 0 multiplicity 1
32 atoms
C  -5.24823097 -1.62413331 -0.00000039
C  -3.96603745 -1.08942486 0.00002193
C  -3.77114657 0.30465746 0.00002234
C  -4.90293833 1.13853616 -0.00000076
C  -6.18764677 0.60192077 -0.00002318
C  -6.3638703 -0.781344 -0.00002294
H  -5.38333535 -2.70822295 -0.00000044
H  -3.10489737 -1.76092432 0.00003909
H  -4.76349989 2.22271001 -0.00000093
H  -7.05523716 1.26572681 -0.00004084
C  3.77114478 0.3046572 0.00002077
C  3.96603567 -1.08942505 0.00003943
C  4.90293657 1.13853597 -0.00002332
C  5.24822925 -1.62413353 0.00001415
H  3.10489565 -1.76092459 0.00007524
C  6.18764496 0.6019206 -0.000049
H  4.76349801 2.22270979 -0.00003726
C  6.36386851 -0.78134423 -0.00003055
H  5.38333353 -2.70822318 0.00002957
H  7.05523544 1.26572652 -0.0000837
C  -0.00000087 1.09079686 0.0000967
O  -0.00000079 2.31712502 0.00004353
C  2.44981307 0.91962521 0.00004434
C  1.25059627 0.30378686 0.00007294
H  2.42611582 2.01569877 0.00003751
H  1.16142181 -0.78572591 0.00007976
C  -1.2505981 0.30378698 0.00007251
C  -2.44981486 0.91962539 0.00004555
H  -1.16142377 -0.78572581 0.00007887
H  -2.4261176 2.01569895 0.00004166
H  -7.37030696 -1.20636314 -0.00004037
H  7.37030524 -1.20636321 -0.00005021
