program: Gaussian 16
title: Coordinates from ORCA-job ts4RE_PdPPh3R1R2R3_f E -113.893879058210
version: ES64L-G16RevA.03
frameworkgroup: CS[SG(OS),X(C2H6)]
method: RPBE1PBE
basis: def2SVP
operation: Freq
keyword: #N
keyword: Geom=AllCheck
keyword: Guess=TCheck
keyword: SCRF=Check
keyword: GenChk
keyword: RPBE1PBE/def2SVP
keyword: Freq
converged: YES YES YES YES
title: Mulliken charges:
elementType: S O C H H H C H H H
charge: 0.411610 -0.669896 -0.171481 0.104921 0.101445 0.094258 -0.171481 0.101445 0.104921 0.094258
chargesum: 0.00000
title: Mulliken charges with hydrogens summed into heavy atoms:
elementType: S O C C
charge: 0.411610 -0.669896 0.129143 0.129143
chargesum: -0.00000
1716.lowfreq: -38.5948 -27.2453 -25.0672 -0.0051 -0.0049 -0.0032 168.5784 243.3142 295.0696
frequency: 168.0903 243.3137 295.0642 316.7986 367.9507 674.1861 700.4182 885.3769 922.3638 963.3527 1019.9918 1094.0363 1286.3854 1313.9295 1402.9095 1416.2724 1416.6903 1437.9354 3065.0771 3066.3886 3197.4362 3199.0235 3203.2800 3205.4371
redmass: 1.0317 1.0756 2.5348 3.8992 3.1010 4.4673 3.8523 1.1844 1.4255 1.5059 1.3663 10.3847 1.2090 1.1972 1.0521 1.0494 1.0454 1.0462 1.0298 1.0300 1.1103 1.1090 1.1075 1.1085
irintensity: 0.0270 2.6144 1.1875 19.9283 13.8490 9.3964 26.5797 4.9098 12.9144 13.5766 25.6830 215.6233 5.5011 17.6547 18.6521 0.2822 12.8771 30.8343 3.3375 3.0649 0.0776 1.8054 0.0432 0.1496
temp: 298.150 k
press: 1.00000 atm
elementType: 16 8 6 1 1 1 6 1 1 1
symmnumber: 1
zpe: 208519.3 jmol-1
zpe.correction: 0.079421 hartree
zpe.thermalcorrener: 0.085024 hartree
zpe.thermalcorrenthalpy: 0.085968 hartree
zpe.thermalcorrgfe: 0.051153 hartree
zpe.sumelectzpe: -552.560760 hartree
zpe.sumelectthermal: -552.555157 hartree
zpe.sumelectthermalent: -552.554212 hartree
zpe.sumelectthermalfe: -552.589028 hartree
dipole: -3.4146 -3.8473 -0.0000
dipole: 5.1440
quadrupole: -35.2555 -33.7635 -27.7737
quadrupole: -2.5102 0.0000 0.0000
quadrupole: -2.9912 -1.4993 4.4905 -2.5102 0.0000 0.0000
hfenergy: -552.6401809 hartree
pointgroup: CS [SG(O1S1),X(C2H6)]
dipole: 1.3979089 -1.4589155 0.1150627 debye
dipolederiv: 1.1842057 -0.3285196 0.0968767 -0.4870489 1.2267052 0.13862 0.2036194 0.0402675 0.8303714 -0.905907 0.1541419 0.0367409 0.5792023 -1.1899472 -0.0155696 -0.2494655 0.2481403 -0.6917056 -0.3385848 0.0193018 -0.1382493 -0.0298236 -0.1388638 -0.0514517 0.0350129 -0.0435532 -0.1173491 0.0596987 -0.0029791 -0.005347 -0.021054 0.0659264 -0.0895661 -0.0005124 -0.0636907 0.0348433 0.0177538 0.0270634 -0.0572298 0.0421294 0.0027471 0.0231323 -0.0262769 0.0229639 0.1093394 -0.0044135 -0.0303872 -0.0277779 -0.0764904 0.077671 0.0387513 0.0351363 0.0637852 0.0043703 -0.1823974 0.1302956 0.0616937 0.004379 -0.165253 -0.0525493 0.0062928 -0.1690449 -0.2471472 0.0850055 0.0815702 0.0050773 0.060107 0.0021996 0.0020848 -0.0215681 -0.0017158 0.0426351 0.0112932 -0.024867 -0.0396274 -0.0125333 0.1084354 -0.0283584 -0.0405962 -0.0577956 0.0407398 0.0733457 -0.0256199 0.0678427 -0.0588673 0.0103794 0.0349067 0.0583577 -0.0393567 -0.0060974 unknown
polarizability: 54.4412375|-3.9774789|52.9435501|5.5080397|6.5473801|51.1767994 unknown
InChI: InChI=1/2C.O.S.6H
charge 0 multiplicity 1
10 atoms
S  1.5652506 1.48590583 -1.15934747
O  0.94676105 2.77957428 -1.64670032
C  3.24497712 1.90043059 -0.63902825
H  3.14444964 2.55782476 0.23472061
H  3.78908143 0.98706762 -0.36111288
H  3.74698678 2.43328131 -1.45917796
C  2.00196158 0.55137608 -2.642581
H  2.5457385 -0.36234221 -2.36519333
H  1.05498516 0.29011258 -3.1331796
H  2.60516176 1.19404966 -3.29962692
