program: Gaussian 16
title: Title
version: ES64L-G16RevA.03
method: RPBE1PBE
basis: def2SVP
operation: Freq
keyword: #N
keyword: Geom=AllCheck
keyword: Guess=TCheck
keyword: SCRF=Check
keyword: GenChk
keyword: RPBE1PBE/def2SVPFreq
converged: YES YES YES YES
title: Mulliken charges:
elementType: Pd P C C C C H C H C H H H C C C C H C H C H H H C C C C H C H C H H H P C C C C H C H C H H H C C C C H C H C H H H C C C C H C H C H H H P C C C C H C H C H H H C C C C H C H C H H H C C C C H C H C H H H P C C C C H C H C H H H C C C C H C H C H H H C C C C H C H C H H H
charge: -0.445314 0.339872 -0.175818 -0.028575 -0.022643 -0.036798 0.051111 -0.027771 0.068934 -0.032049 0.045836 0.041122 0.049379 -0.199475 -0.034729 0.010175 -0.026421 0.050236 -0.029703 0.052976 -0.040730 0.045463 0.040109 0.048210 -0.164940 -0.028529 -0.031443 -0.036078 0.050430 -0.032895 0.073808 -0.031777 0.044608 0.041872 0.047583 0.331636 -0.216234 -0.028008 -0.017865 -0.029003 0.053952 -0.020778 0.081989 -0.040276 0.046323 0.041077 0.048707 -0.166121 0.010451 -0.034898 -0.024681 0.044041 -0.037740 0.048719 -0.035916 0.040938 0.044659 0.048136 -0.207468 -0.027892 -0.011698 -0.034291 0.049302 -0.025560 0.078293 -0.040375 0.044883 0.039507 0.046918 0.331934 -0.214896 -0.028350 -0.018236 -0.028939 0.053913 -0.020970 0.082122 -0.040233 0.046307 0.041006 0.048723 -0.167379 -0.034461 0.010104 -0.037515 0.048542 -0.024865 0.045429 -0.035824 0.044612 0.040798 0.048009 -0.207785 -0.027894 -0.011880 -0.034240 0.049468 -0.026594 0.079364 -0.040227 0.044936 0.039702 0.046987 0.339722 -0.198846 -0.034011 0.008748 -0.026541 0.050196 -0.029469 0.052795 -0.040643 0.045455 0.040195 0.048257 -0.165350 -0.028878 -0.031316 -0.036002 0.050349 -0.032442 0.074336 -0.031685 0.044683 0.041756 0.047696 -0.176169 -0.021470 -0.028548 -0.028493 0.068974 -0.036810 0.051194 -0.032066 0.041048 0.045672 0.049231
chargesum: -0.00000
title: Mulliken charges with hydrogens summed into heavy atoms:
elementType: Pd P C C C C C C C C C C C C C C C C C C P C C C C C C C C C C C C C C C C C C P C C C C C C C C C C C C C C C C C C P C C C C C C C C C C C C C C C C C C
charge: -0.445314 0.339872 -0.175818 0.022536 0.046291 0.009038 0.013350 0.017330 -0.199475 0.015508 0.063151 0.019043 0.010405 0.007480 -0.164940 0.021900 0.042365 0.008529 0.008977 0.015807 0.331636 -0.216234 0.025944 0.064124 0.017320 0.020299 0.008432 -0.166121 0.054493 0.013822 0.016257 0.006919 0.012219 -0.207468 0.021411 0.066595 0.010592 0.013947 0.006543 0.331934 -0.214896 0.025563 0.063887 0.017367 0.020036 0.008490 -0.167379 0.014080 0.055533 0.007097 0.015932 0.012185 -0.207785 0.021575 0.067484 0.010696 0.013108 0.006759 0.339722 -0.198846 0.016185 0.061543 0.018914 0.010726 0.007614 -0.165350 0.021471 0.043021 0.008681 0.009313 0.016011 -0.176169 0.047504 0.022645 0.012555 0.008862 0.017165
chargesum: -0.00001
1716.lowfreq: -2.3152 0.0005 0.0007 0.0016 3.4976 7.5413 16.7561 22.2082 26.3095
temp: 298.150 k
press: 1.00000 atm
elementType: 46 15 6 6 6 6 1 6 1 6 1 1 1 6 6 6 6 1 6 1 6 1 1 1 6 6 6 6 1 6 1 6 1 1 1 15 6 6 6 6 1 6 1 6 1 1 1 6 6 6 6 1 6 1 6 1 1 1 6 6 6 6 1 6 1 6 1 1 1 15 6 6 6 6 1 6 1 6 1 1 1 6 6 6 6 1 6 1 6 1 1 1 6 6 6 6 1 6 1 6 1 1 1 15 6 6 6 6 1 6 1 6 1 1 1 6 6 6 6 1 6 1 6 1 1 1 6 6 6 6 1 6 1 6 1 1 1
symmnumber: 1
zpe: 2912692.0 jmol-1
zpe.correction: 1.109386 hartree
zpe.thermalcorrener: 1.178679 hartree
zpe.thermalcorrenthalpy: 1.179623 hartree
zpe.thermalcorrgfe: 0.999725 hartree
zpe.sumelectzpe: -4266.212701 hartree
zpe.sumelectthermal: -4266.143409 hartree
zpe.sumelectthermalent: -4266.142464 hartree
zpe.sumelectthermalfe: -4266.322363 hartree
dipole: -0.0073 -0.0463 0.0159
dipole: 0.0495
quadrupole: -439.8681 -440.5571 -444.7497
quadrupole: -0.1196 2.5895 1.3128
quadrupole: 1.8569 1.1678 -3.0247 -0.1196 2.5895 1.3128
hfenergy: -4267.3220873 hartree
pointgroup: C01 [X(C72H60P4Pd1)]
dipole: -0.0028701 -0.0182278 0.0062584 debye
polarizability: 1432.7239937|3.95931|1420.0709302|-0.7882667|3.0584513|1383.8564643 unknown
InChI: InChI=1/72C.4P.Pd.60H
charge 0 multiplicity 1
137 atoms
Pd -0.00677685 0.01930419 -0.00954881
P  1.22332488 -1.16281941 1.68981652
C  1.56451132 -0.26482617 3.26387388
C  2.79067811 -0.31655254 3.93749619
C  0.52311142 0.49105931 3.81589949
C  2.9709648 0.38539481 5.13012299
H  3.61605905 -0.90562334 3.53219656
C  0.69843325 1.18483907 5.01048135
H  -0.43703224 0.53599711 3.30092175
C  1.92858711 1.13931601 5.66925124
H  3.93670852 0.34244662 5.64065004
H  -0.12859155 1.76913503 5.42279011
H  2.07449562 1.69051659 6.60184114
C  2.92685897 -1.73393634 1.25906647
C  3.35837285 -3.06025757 1.38353734
C  3.8208575 -0.78291045 0.74778264
C  4.64801895 -3.42490823 0.99075228
H  2.68709428 -3.82252367 1.78382076
C  5.11016685 -1.14363613 0.36673908
H  3.50401074 0.25600849 0.65208157
C  5.5276948 -2.47101101 0.4807687
H  4.96531861 -4.46659418 1.08785756
H  5.78828657 -0.38231782 -0.02827622
H  6.53554413 -2.76063043 0.17246034
C  0.52314442 -2.73249061 2.35679563
C  0.5077426 -3.05393421 3.71897445
C  0.00373013 -3.65465732 1.43909928
C  -0.02151746 -4.27054412 4.15160252
H  0.9080974 -2.3525309 4.45392281
C  -0.51437617 -4.87414122 1.86876821
H  0.00265906 -3.41337116 0.37461105
C  -0.5326087 -5.18399811 3.2301442
H  -0.03388234 -4.50406275 5.21955717
H  -0.9115559 -5.58055102 1.13541575
H  -0.94762618 -6.13574019 3.57187715
P  -2.15736578 0.65609359 0.8454172
C  -3.6844841 0.40986019 -0.16915
C  -4.8521622 -0.18311954 0.33036015
C  -3.67224728 0.84503612 -1.50119376
C  -5.96946992 -0.3510757 -0.48838756
H  -4.89511663 -0.5239969 1.36644195
C  -4.79483456 0.69736177 -2.31282952
H  -2.77012216 1.29173628 -1.91987716
C  -5.94593407 0.08898277 -1.81131127
H  -6.86763605 -0.82491634 -0.08341756
H  -4.76170119 1.04847057 -3.34701024
H  -6.82274668 -0.04163757 -2.45070722
C  -2.40308047 2.41747579 1.33954434
C  -1.31664821 3.09738944 1.9002612
C  -3.61427503 3.10155861 1.17818285
C  -1.42942602 4.42744005 2.29654652
H  -0.36641965 2.57311105 2.00727274
C  -3.72695451 4.43834542 1.56189635
H  -4.47906057 2.59417526 0.74528273
C  -2.63687991 5.10510599 2.12118787
H  -0.56530088 4.93985885 2.72731802
H  -4.67588142 4.96249143 1.42040853
H  -2.72623548 6.15416999 2.41500567
C  -2.66496384 -0.20920793 2.39207117
C  -3.0634123 0.45440572 3.55877678
C  -2.62890222 -1.61067239 2.38875204
C  -3.40530395 -0.270854 4.70155926
H  -3.10169607 1.54560041 3.58361753
C  -3.00091693 -2.33375298 3.5188723
H  -2.30798244 -2.14093821 1.48970529
C  -3.37984467 -1.66476291 4.68439906
H  -3.70089992 0.2613746 5.60968551
H  -2.97853837 -3.42591772 3.49203404
H  -3.653764 -2.23073219 5.5785454
P  1.30055548 1.92576483 -0.64728905
C  2.72290049 2.48314139 0.39487
C  3.99009072 2.77832991 -0.12606206
C  2.51893259 2.61611829 1.77480724
C  5.02841849 3.17717689 0.71647603
H  4.17658509 2.69236715 -1.19817737
C  3.54915767 3.03466315 2.61384555
H  1.54749906 2.37405645 2.20651916
C  4.81244354 3.30734678 2.08790862
H  6.01299895 3.39302214 0.29307031
H  3.36425589 3.13375194 3.68624734
H  5.62691287 3.62081242 2.7460061
C  0.42290919 3.5356375 -0.85443187
C  0.99219422 4.77263669 -0.52794151
C  -0.88170707 3.50713741 -1.35836603
C  0.26242064 5.95040572 -0.69255745
H  2.01041693 4.82307185 -0.13615068
C  -1.6082882 4.68141701 -1.5353269
H  -1.33357009 2.54252995 -1.59208515
C  -1.03849311 5.90891119 -1.1944255
H  0.71540034 6.90839837 -0.4236955
H  -2.62909889 4.63433261 -1.92336315
H  -1.61014192 6.83277051 -1.31509152
C  2.14453762 1.78006245 -2.27984591
C  2.01289015 2.72075663 -3.3085277
C  2.94547707 0.64960932 -2.49458359
C  2.65828463 2.52530374 -4.53086082
H  1.39700449 3.61084244 -3.16255524
C  3.6131175 0.47085306 -3.70307856
H  3.04763796 -0.097894 -1.70487061
C  3.46227319 1.40391206 -4.73086905
H  2.53516773 3.2615625 -5.32967098
H  4.24184183 -0.41129818 -3.84655544
H  3.97085176 1.25526373 -5.68694495
P  -0.38554153 -1.38757783 -1.92504492
C  -1.39090777 -2.91670638 -1.6706007
C  -0.95576322 -4.2007525 -2.02096745
C  -2.64523394 -2.77731464 -1.06034859
C  -1.75148387 -5.3162784 -1.75121483
H  0.01370623 -4.34142021 -2.50276029
C  -3.44367482 -3.88777457 -0.80127383
H  -3.00331243 -1.78402587 -0.78793537
C  -2.99573882 -5.16581278 -1.14048361
H  -1.39209871 -6.31190905 -2.0246864
H  -4.41805914 -3.75130745 -0.32439707
H  -3.61445992 -6.04151491 -0.92835678
C  1.07405903 -2.10977111 -2.78906479
C  1.20210444 -2.15821059 -4.18203664
C  2.09065929 -2.65909854 -1.99753453
C  2.3274232 -2.73951102 -4.76783773
H  0.42209846 -1.73859818 -4.82078984
C  3.2088364 -3.25008308 -2.58119089
H  2.00600223 -2.62022281 -0.91010189
C  3.3326899 -3.28731658 -3.97146166
H  2.41741134 -2.76271574 -5.85714051
H  3.9888667 -3.67563402 -1.94481968
H  4.21368326 -3.74087213 -4.43295631
C  -1.27464485 -0.64166735 -3.35823992
C  -0.90281136 0.65088551 -3.74858869
C  -2.27700938 -1.30142301 -4.07922425
C  -1.51802404 1.27566059 -4.83031212
H  -0.12011296 1.17322692 -3.1974219
C  -2.90082127 -0.67305975 -5.15799149
H  -2.5799231 -2.31273599 -3.80005336
C  -2.5264287 0.61624521 -5.53585704
H  -1.21182449 2.28530752 -5.11714483
H  -3.68826797 -1.19744414 -5.70581428
H  -3.01950407 1.1068641 -6.37904892
