program: Gaussian 16
title: Title
version: ES64L-G16RevA.03
method: RPBE1PBE
basis: def2SVP
operation: Freq
keyword: #N
keyword: Geom=AllCheck
keyword: Guess=TCheck
keyword: SCRF=Check
keyword: GenChk
keyword: RPBE1PBE/def2SVPFreq
converged: YES YES NO NO
title: Mulliken charges:
elementType: Pd P C C C C H C H C H H H C C C C H C H C H H H C C C C H C H C H H H P C C C C H C H C H H H C C C C H C H C H H H C C C C H C H C H H H
charge: -0.455455 0.393718 -0.178574 -0.020422 -0.022869 -0.036560 0.064492 -0.034470 0.051956 -0.033077 0.051232 0.050420 0.053576 -0.178518 -0.020009 -0.024446 -0.036724 0.064561 -0.034303 0.052074 -0.033502 0.051179 0.050285 0.053401 -0.179808 -0.023374 -0.020687 -0.034074 0.051361 -0.036221 0.064941 -0.033165 0.050458 0.051247 0.053639 0.392538 -0.178833 -0.020740 -0.023850 -0.036278 0.064955 -0.034197 0.051430 -0.033055 0.051243 0.050466 0.053634 -0.178067 -0.020631 -0.023120 -0.036286 0.064666 -0.034778 0.051745 -0.033177 0.051284 0.050493 0.053651 -0.178239 -0.024057 -0.020322 -0.034460 0.052027 -0.036390 0.064498 -0.033462 0.050331 0.051229 0.053475
chargesum: -0.00000
title: Mulliken charges with hydrogens summed into heavy atoms:
elementType: Pd P C C C C C C C C C C C C C C C C C C P C C C C C C C C C C C C C C C C C C
charge: -0.455455 0.393718 -0.178574 0.044070 0.029087 0.014672 0.015950 0.020498 -0.178518 0.044553 0.027628 0.014455 0.015982 0.019899 -0.179808 0.027986 0.044254 0.016384 0.015026 0.020474 0.392538 -0.178833 0.044215 0.027580 0.014964 0.016269 0.020579 -0.178067 0.044035 0.028625 0.014998 0.015714 0.020474 -0.178239 0.027970 0.044176 0.015871 0.014838 0.020012
chargesum: 0.00000
1716.lowfreq: -5.1726 -2.5718 0.0005 0.0009 0.0015 2.4298 6.1100 7.0466 9.6193
frequency: 4.3799 6.6153 9.0872 18.2315 22.1435 27.4928 34.3339 36.8498 38.0636 39.7206 45.4829 46.7952 50.2628 50.4628 57.2360 58.0464 63.7994 88.9023 90.4543 147.1593 182.1000 190.6570 212.3675 213.0671 215.7657 216.3802 217.9624 254.1165 254.9316 265.3955 266.0294 267.3635 268.0355 409.8749 410.6174 411.5798 412.3998 414.1647 415.9335 435.4844 442.2167 442.5756 446.8030 446.9055 456.4067 513.7976 515.3526 515.7817 517.0601 517.5003 540.8147 626.9420 627.0259 627.1221 627.2293 627.6934 628.0029 702.6622 705.8164 719.0404 719.2424 719.4442 719.6517 721.6562 721.9299 722.8724 723.1277 723.5029 724.7712 772.0773 773.4878 776.2987 776.5390 777.1799 777.8000 873.5819 873.6949 874.2304 874.9552 875.9050 876.5764 953.8392 954.2007 954.7471 955.6785 955.8229 956.8448 1013.1338 1013.2505 1013.5651 1013.6754 1013.7158 1014.4202 1014.8223 1014.9898 1015.5742 1015.6776 1016.3726 1017.0840 1038.3004 1038.6811 1038.8382 1039.1486 1039.7763 1040.2908 1055.9125 1055.9991 1056.1379 1056.3165 1056.4713 1056.7408 1099.0259 1099.4528 1099.5699 1099.8843 1100.2052 1101.0192 1128.3546 1128.4362 1128.5755 1128.8189 1132.2883 1132.7043 1155.3246 1155.4126 1155.8563 1156.2819 1156.3657 1157.7850 1179.7339 1180.4494 1180.7045 1180.8668 1181.9048 1182.5306 1314.9834 1315.2454 1316.1187 1316.6571 1316.7652 1317.8904 1387.5365 1387.8834 1390.0802 1390.1414 1390.3097 1390.5002 1468.9288 1469.1939 1469.6119 1469.7967 1469.9871 1470.7546 1512.8468 1513.0023 1513.1086 1513.2634 1513.6230 1514.2142 1653.9347 1654.2149 1654.8537 1654.8886 1655.0722 1655.1995 1669.4440 1669.4984 1669.5333 1669.6791 1670.8336 1671.0245 3186.6327 3186.8215 3187.3045 3188.0344 3188.7517 3188.8792 3205.9460 3206.2482 3206.4324 3206.6326 3206.7549 3206.9103 3213.2482 3213.6941 3213.8831 3214.0058 3214.3760 3214.7844 3220.5097 3220.7759 3220.9166 3221.0316 3221.2426 3221.6344 3228.8822 3229.0355 3229.0788 3229.1840 3229.3066 3229.3728
redmass: 5.9641 5.6067 6.5734 4.1322 3.6728 3.9001 4.3543 4.7698 5.4606 3.9233 5.2029 4.0670 5.2856 5.3620 5.5116 5.5092 5.6395 12.6218 12.7788 6.0008 4.7510 4.6507 4.6312 4.6314 4.7041 4.7210 13.6447 5.4562 5.4498 4.6824 4.6904 4.6943 4.7205 2.8359 2.8382 2.8370 2.8426 2.8092 2.8171 6.5484 7.5739 7.5497 7.4785 7.4335 4.7403 4.5091 4.0208 4.0170 4.0541 4.0477 6.1789 6.3585 6.3570 6.3561 6.3600 6.3775 6.3871 6.3199 6.3938 5.6390 5.5813 5.0525 4.5481 1.8269 1.7409 1.6812 1.6827 1.6776 1.6678 1.8807 1.8804 1.9286 1.9413 1.9360 1.9301 1.2504 1.2500 1.2501 1.2483 1.2481 1.2477 1.3796 1.3736 1.3782 1.3750 1.3722 1.3721 3.2319 3.4637 3.3575 3.6093 4.7473 3.5115 1.7983 1.6951 1.6303 1.9133 1.4292 1.4860 1.3435 1.3464 1.3448 1.3428 1.3436 1.3430 2.3533 2.3749 2.3735 2.3802 2.3820 2.4000 1.4494 1.4523 1.4507 1.4510 1.4537 1.4555 3.0459 3.0439 3.0387 3.0300 2.9380 2.9422 1.0632 1.0624 1.0629 1.0627 1.0639 1.0634 1.1120 1.1111 1.1102 1.1111 1.1080 1.1090 1.3557 1.3557 1.3473 1.3437 1.3441 1.3479 7.0516 7.0740 7.5753 7.5731 7.5948 7.5262 2.4254 2.4287 2.4318 2.4262 2.4305 2.4192 2.3366 2.3323 2.3395 2.3280 2.3531 2.3342 6.3902 6.3930 6.4110 6.4026 6.4106 6.3934 6.4330 6.4263 6.4292 6.4190 6.4621 6.4532 1.0915 1.0915 1.0914 1.0913 1.0912 1.0913 1.0877 1.0875 1.0875 1.0876 1.0875 1.0875 1.0918 1.0917 1.0917 1.0917 1.0917 1.0917 1.0965 1.0965 1.0965 1.0965 1.0965 1.0964 1.1011 1.1010 1.1011 1.1011 1.1011 1.1011
irintensity: 0.1329 0.1769 0.4374 0.2135 0.0658 0.2498 0.1961 0.0275 0.0102 0.0781 0.0180 0.0519 0.2296 0.3193 0.1078 0.1092 0.6153 0.4636 0.4038 0.0002 1.4655 0.0046 2.8629 3.4188 0.1913 0.8621 36.5761 0.5322 0.2770 1.1909 1.3813 0.3967 0.5247 0.1786 0.1130 0.6929 0.7690 0.5050 0.1445 189.9198 0.9195 0.7163 24.2786 24.6048 0.2689 414.3909 31.4166 74.1410 76.9731 90.5541 0.1558 0.2288 0.6717 0.8146 1.0892 6.9659 0.2419 49.0422 0.0320 5.3413 14.3899 48.0316 59.3551 94.6552 120.2965 61.6459 42.1247 25.7451 11.7081 15.2349 2.8822 25.3258 19.5626 38.1137 31.6725 0.2182 0.4873 1.2116 1.4370 1.7195 0.5841 1.8689 0.9323 1.5860 0.2184 0.1013 0.2451 0.2568 0.4630 6.9065 6.0036 10.1390 0.4517 0.3928 0.5531 3.5758 2.3848 2.1195 0.9709 0.1753 0.1855 0.0287 0.3031 0.2304 0.1520 13.0404 7.1480 8.7204 10.4585 10.5393 12.2122 6.6836 11.8346 6.4082 4.7236 6.9025 4.8677 18.6181 92.6111 33.8766 65.4982 33.6533 2.1775 0.1340 0.0330 0.1088 0.0633 0.1184 0.0814 4.6416 4.6647 3.3002 5.4850 1.8229 2.4663 19.0983 4.4744 3.6035 3.6991 3.0012 3.5451 4.0912 0.0529 3.0179 1.7277 2.9369 2.4507 118.5579 4.9219 21.3344 40.9205 9.8741 23.4405 16.7223 17.8321 12.3780 20.4542 8.2558 12.5918 3.7736 0.0697 0.5050 0.5499 0.1511 0.2798 0.9342 1.1184 0.8365 0.9760 1.2975 0.0581 1.7943 3.1808 1.8763 0.7033 1.3331 0.9357 0.0772 0.1169 0.0672 0.1279 0.0526 0.1071 0.8806 1.0626 1.6258 1.4766 1.8394 2.2380 9.9863 6.5212 12.9926 7.8295 13.4891 10.0724 18.3309 16.9433 20.1316 20.3277 17.6336 4.7500
temp: 298.150 k
press: 1.00000 atm
elementType: 46 15 6 6 6 6 1 6 1 6 1 1 1 6 6 6 6 1 6 1 6 1 1 1 6 6 6 6 1 6 1 6 1 1 1 15 6 6 6 6 1 6 1 6 1 1 1 6 6 6 6 1 6 1 6 1 1 1 6 6 6 6 1 6 1 6 1 1 1
symmnumber: 1
zpe: 1452431.2 jmol-1
zpe.correction: 0.553202 hartree
zpe.thermalcorrener: 0.588992 hartree
zpe.thermalcorrenthalpy: 0.589936 hartree
zpe.thermalcorrgfe: 0.473582 hartree
zpe.sumelectzpe: -2197.031254 hartree
zpe.sumelectthermal: -2196.995463 hartree
zpe.sumelectthermalent: -2196.994519 hartree
zpe.sumelectthermalfe: -2197.110873 hartree
dipole: 0.0946 -0.0401 0.0210
dipole: 0.1048
quadrupole: -224.6889 -208.4098 -228.2070
quadrupole: 9.4922 1.1395 3.0234
quadrupole: -4.2536 12.0254 -7.7717 9.4922 1.1395 3.0234
hfenergy: -2197.5844553 hartree
pointgroup: C01 [X(C36H30P2Pd1)]
dipole: 0.0371999 -0.0157585 0.0082599 debye
polarizability: 709.890522|1.8154688|715.3302311|-0.7199703|2.48977|712.1444029 unknown
InChI: InChI=1/36C.2P.Pd.30H
charge 0 multiplicity 1
69 atoms
Pd 0.66622144 0.64668103 0.45042098
P  -0.25109223 -1.42236124 0.18074883
C  -1.6054757 -1.841608 1.34298547
C  -2.50347395 -0.82076353 1.68516411
C  -1.77939703 -3.11974216 1.88632467
C  -3.56925228 -1.07916181 2.54418166
H  -2.35672277 0.18463097 1.27721441
C  -2.8416274 -3.37286319 2.75488115
H  -1.08367039 -3.92331906 1.63222423
C  -3.73860574 -2.35625503 3.08227364
H  -4.26522577 -0.27708574 2.80301487
H  -2.96845206 -4.37300484 3.17737586
H  -4.56923369 -2.55754704 3.76369242
C  0.92737464 -2.81116613 0.39216376
C  1.87476116 -2.70279347 1.42045072
C  0.91857489 -3.95419281 -0.41508162
C  2.78776278 -3.72974319 1.64775363
H  1.8966741 -1.80027642 2.0400162
C  1.84241924 -4.97618939 -0.19255057
H  0.18884449 -4.05028424 -1.22284995
C  2.77449886 -4.86796502 0.83898928
H  3.52038215 -3.63682197 2.45362195
H  1.83128712 -5.8637187 -0.83056359
H  3.49722907 -5.66990596 1.01028403
C  -0.99290866 -1.74462441 -1.46448135
C  -2.15154361 -2.5085068 -1.64639687
C  -0.34843426 -1.19601008 -2.5822336
C  -2.65367613 -2.72448301 -2.93011796
H  -2.66696374 -2.938093 -0.78382527
C  -0.84596887 -1.42228164 -3.86357685
H  0.54652149 -0.58155721 -2.439511
C  -2.00165872 -2.18562469 -4.03908615
H  -3.5612602 -3.31900065 -3.06315855
H  -0.33509676 -0.99201652 -4.72879759
H  -2.39820768 -2.35548616 -5.04343441
P  1.63245997 2.69069783 0.73844255
C  0.49923482 4.03238655 1.26455837
C  -0.5222744 3.69903965 2.16513022
C  0.61696525 5.35381566 0.81843679
C  -1.40142226 4.67646204 2.62596354
H  -0.6281295 2.66150817 2.49866309
C  -0.27190979 6.32844226 1.2731858
H  1.40548325 5.62682012 0.11276123
C  -1.27837024 5.99324935 2.17866961
H  -2.19312034 4.40716877 3.32980147
H  -0.17517334 7.35736384 0.91706473
H  -1.97345777 6.75890866 2.53282442
C  2.44549932 3.3864767 -0.75025298
C  1.82094709 3.1715783 -1.98695425
C  3.63832364 4.11706642 -0.70104157
C  2.37221667 3.69443728 -3.15456321
H  0.89889788 2.58256231 -2.02877836
C  4.19375577 4.63052353 -1.87352021
H  4.13846717 4.28779604 0.25553575
C  3.56159921 4.42344467 -3.09941269
H  1.87649163 3.52344081 -4.11361609
H  5.1272362 5.19735606 -1.82708252
H  3.99988389 4.82636148 -4.01612645
C  2.95982373 2.74107742 2.00259444
C  3.14241584 3.81549609 2.88055364
C  3.82772756 1.64180962 2.0711314
C  4.18339006 3.79178967 3.80959586
H  2.4706026 4.67654297 2.84147113
C  4.87318944 1.62639436 2.99135045
H  3.67359061 0.79110356 1.39919066
C  5.05108183 2.70142545 3.86444954
H  4.31640613 4.63333178 4.49442637
H  5.54634721 0.76629468 3.0345246
H  5.86553908 2.68577896 4.59334009
