program: Gaussian 16
title: Title
version: ES64L-G16RevA.03
method: RPBE1PBE
basis: def2SVP
operation: Freq
keyword: #N
keyword: Geom=AllCheck
keyword: Guess=TCheck
keyword: SCRF=Check
keyword: GenChk
keyword: RPBE1PBE/def2SVP
keyword: Freq
converged: YES YES NO NO
title: Mulliken charges:
elementType: Pd P C C C C H C H C H H H C C C C H C H C H H H C C C C H C H C H H H P C C C C H C H C H H H C C C C H C H C H H H C C C C H C H C H H H C C C C C H H H H H N C O O C C C C H C H C H H H C H H H C C C C C C H H H H H H H H H
charge: -0.175762 0.370420 -0.161708 -0.012310 -0.006558 -0.018107 0.068226 -0.023289 0.052916 -0.016509 0.043632 0.046956 0.048776 -0.176345 0.000802 -0.031369 -0.012784 0.046471 -0.015432 0.060903 -0.017172 0.042224 0.045907 0.048841 -0.150987 -0.006083 -0.009358 -0.020230 0.046220 -0.009671 0.046357 -0.016603 0.048095 0.045153 0.050188 0.369283 -0.163944 -0.011857 -0.039971 -0.022306 0.047944 -0.023414 0.078647 -0.013330 0.043399 0.050682 0.043590 -0.154546 -0.028716 -0.011143 -0.026563 0.040233 -0.016957 0.044379 -0.020405 0.044049 0.041606 0.045987 -0.183114 -0.015846 -0.042433 -0.019042 0.055155 -0.013388 0.081582 -0.013240 0.048123 0.044470 0.050363 0.001631 0.106616 -0.028230 -0.155588 0.050058 0.069050 0.080205 0.106754 0.115399 0.047813 -0.330339 0.406819 -0.333717 -0.292247 0.149588 -0.017462 -0.023478 -0.039267 0.036959 -0.040920 0.040952 -0.018140 0.047393 0.046715 0.043615 0.022433 0.056497 0.058855 0.060276 0.038864 -0.121227 -0.228767 0.038543 -0.050870 -0.049928 0.114018 0.071807 0.068200 0.067804 0.046079 0.049362 0.046846 0.045431 0.054514
chargesum: 1.00000
title: Mulliken charges with hydrogens summed into heavy atoms:
elementType: Pd P C C C C C C C C C C C C C C C C C C P C C C C C C C C C C C C C C C C C C C C C C C N C O O C C C C C C C C C C C C C
charge: -0.175762 0.370420 -0.161708 0.055916 0.046358 0.025525 0.023667 0.032266 -0.176345 0.047273 0.029534 0.029440 0.030476 0.031669 -0.150987 0.040137 0.036998 0.027865 0.035482 0.033585 0.369283 -0.163944 0.036087 0.038675 0.021093 0.027268 0.030261 -0.154546 0.011517 0.033236 0.017485 0.024648 0.025582 -0.183114 0.039308 0.039149 0.029081 0.031082 0.037123 0.070682 0.186821 0.078524 -0.040188 0.097870 -0.330339 0.406819 -0.333717 -0.292247 0.149588 0.019497 0.017474 0.008126 0.005794 0.025475 0.198061 0.165186 -0.007210 -0.228767 0.174547 0.044570 0.042349
1716.lowfreq: -7.0443 -3.3888 0.0005 0.0007 0.0009 4.1601 6.4278 14.2739 21.1724
redmass: 5.4099 4.8538 5.3061 4.9684 4.9298 5.0659 4.4215 5.4578 4.9526 4.9833 5.2664 6.0447 5.1237 5.3658 5.2982 5.5417 5.2529 4.3402 4.9574 4.6798 7.1309 4.8186 4.2178 5.5262 5.8176 4.1615 6.9525 4.3651 4.2467 4.7010 3.1511 4.3667 4.6839 3.4222 5.8239 5.8177 5.5446 4.5052 4.9583 5.1425 4.2368 2.1051 4.9208 2.8963 2.7887 2.3058 4.7400 5.1329 5.2601 4.2041 3.5017 4.7289 4.9502 4.9017 2.2617 2.6855 3.9786 5.8243 2.8409 3.1814 3.2571 2.9927 2.8962 2.9504 3.2233 3.4990 4.1359 7.1485 4.9708 6.3287 3.3543 5.5779 4.0530 3.5407 4.2159 4.8088 5.2980 3.6527 4.4955 4.1680 3.7427 4.6936 4.8066 3.1900 6.6461 3.7651 6.3240 6.3749 6.3617 6.3737 6.3725 6.3773 6.3390 4.1547 3.9811 6.3920 5.9295 2.9777 1.8246 4.9897 1.8769 1.9115 2.0047 3.1328 2.3164 6.1796 1.8163 3.6918 1.8324 1.6867 3.4961 1.7601 1.8460 1.8673 2.3424 1.9704 1.9633 1.4889 2.7217 1.4710 3.5329 1.2894 1.5531 3.2856 1.2825 1.2521 1.2500 1.2536 3.1353 1.2456 1.2630 2.3306 1.4813 2.1430 1.6473 1.3545 1.5181 1.3484 1.3434 1.3548 1.4048 1.6872 1.4756 1.6722 2.4222 1.3699 1.3140 1.4227 3.2205 2.7350 1.5675 3.5569 2.3235 2.4584 2.7023 3.6314 4.5017 5.2256 1.5081 1.3605 1.3273 1.3155 1.3290 1.3322 1.3429 1.3378 1.2998 1.9924 2.0516 2.2203 2.3587 2.4016 2.4436 2.5375 2.3615 1.9901 1.7644 1.7237 1.3970 1.4327 1.4629 1.4159 1.4868 1.5256 1.4872 1.5303 2.2893 2.7799 2.9189 2.8317 2.8681 2.9290 2.8771 2.2433 1.1972 1.5696 1.0853 1.0781 1.0658 1.0639 1.0693 1.0646 1.0617 1.1281 1.5853 1.2642 1.2899 1.1158 1.1148 1.1133 1.1125 1.1133 1.6073 1.2721 2.4366 1.7413 1.7284 1.5149 1.3682 1.3809 1.3242 1.3168 1.3562 1.3726 1.3373 1.3568 1.4049 1.5899 1.6339 1.5608 1.6524 1.9134 1.7383 5.7921 2.9946 5.5759 2.1597 7.1080 7.0499 7.4719 5.2799 4.2906 1.2418 1.9229 1.0954 1.1052 1.0933 1.0980 1.1223 2.3862 2.3904 2.4039 2.3993 2.3114 2.4196 2.4375 2.5827 2.3312 2.2731 2.3151 2.2785 2.2848 2.2632 2.7651 6.3793 6.0883 6.1161 6.1821 6.2781 6.3163 6.3795 6.0764 6.2715 6.2917 6.3245 6.2874 6.2987 6.3239 6.8779 6.9120 12.6856 1.0719 1.0668 1.0366 1.0638 1.0646 1.0914 1.0874 1.1004 1.1021 1.1040 1.0878 1.1026 1.0906 1.1048 1.0908 1.0896 1.0886 1.0865 1.0867 1.0878 1.0877 1.0869 1.0869 1.0889 1.0879 1.0894 1.0894 1.0920 1.0904 1.0911 1.0925 1.0908 1.0922 1.0931 1.0936 1.0966 1.0941 1.0956 1.0967 1.0952 1.0958 1.0970 1.0981 1.1000 1.1007 1.1010 1.1004 1.0981 1.0985 1.0993 1.0980 1.0959
irintensity: 0.1375 0.0316 0.0742 0.0992 0.1059 0.0334 0.0706 0.1258 0.0713 0.0313 0.2711 0.8653 1.0503 0.3373 0.7967 0.2730 0.7042 0.3288 0.2203 0.8546 1.2982 0.3937 1.1383 0.8461 2.0445 0.2448 0.2376 0.3365 0.3537 1.8846 1.1368 0.8540 2.1640 2.3797 4.9008 3.9070 3.4821 0.1576 1.5399 1.7214 0.4489 6.4693 1.0538 1.1015 1.5141 0.8102 1.2525 3.1083 4.4126 1.6321 0.2313 0.2658 7.3301 3.0886 2.1342 13.1438 1.8629 9.6036 0.1099 6.6925 7.4443 3.1511 1.6153 0.7408 2.4709 7.7870 17.5079 11.1380 10.5029 13.5981 27.7663 21.5273 16.3804 19.5225 49.6077 39.6414 106.8737 56.3427 70.7053 59.9040 29.1634 152.8236 136.2252 18.1444 21.7980 8.2626 5.6256 0.9596 0.8447 0.2133 1.2164 2.9192 0.7893 14.9326 5.0803 5.6118 15.3987 9.4007 52.4398 38.7947 115.5122 36.1745 97.7450 31.6181 30.6579 23.2321 59.2563 27.0857 27.6645 29.5278 40.2264 23.0645 19.8084 2.0941 122.1314 14.9648 4.8059 46.4599 8.3805 11.5719 13.0459 10.0391 28.7981 27.1010 0.1704 0.8179 1.0308 1.4215 12.5138 1.8473 1.7545 32.5412 22.5155 8.2479 6.3338 1.8596 42.6323 0.1699 1.4980 0.1406 13.1611 5.5281 0.5869 19.6337 6.1252 0.2586 129.3301 0.4448 4.8484 2.3681 4.6233 3.7036 0.4409 8.6516 2.0491 2.0752 4.1550 13.1624 1.7093 1.1389 0.0477 0.6242 0.2457 0.3604 0.2477 0.7310 1.1024 78.1041 1.1625 16.2094 7.5691 6.7894 3.7128 13.6888 29.7506 45.0591 13.9889 0.8992 24.7671 4.7711 5.2232 4.5334 9.4895 8.2251 6.8895 8.3248 51.4794 36.7048 59.2090 28.8690 50.2850 67.3645 43.5058 39.3148 34.8924 15.8702 0.1045 0.1612 0.0629 0.3509 0.1039 0.6331 0.5283 2.4061 14.7425 18.4017 56.9101 5.3772 10.2417 2.8009 6.6359 2.7594 0.4669 7.0905 489.4502 219.5150 454.7231 240.5662 6.1897 9.4419 14.8403 3.2428 28.1619 1.2758 2.9915 9.8548 32.0478 154.3043 165.1068 20.5061 59.2766 122.4522 19.5001 0.9355 60.6736 0.9456 83.4499 0.6429 3.6227 0.1555 102.1528 810.0377 37.5008 75.1870 11.0451 11.6606 32.6064 11.7048 9.4264 36.6954 18.7321 19.0641 97.0331 157.0425 29.9543 28.1483 4.5963 7.8529 16.7250 12.7417 21.9901 2.9893 14.1597 72.7933 36.4446 1.9157 0.4660 3.5007 26.5536 12.0972 22.0038 700.0953 4.6168 0.5978 1.7968 1.1849 3.1642 10.4927 13.0947 17.7453 1102.6056 20.3737 44.5242 22.8686 39.5227 29.1513 17.7135 26.7928 24.3934 26.8891 53.6325 3.0909 8.5296 21.0023 13.6796 2.3100 0.8860 0.9565 0.0336 0.7450 0.1577 2.1696 0.0974 0.4799 0.7469 3.4736 6.7255 2.4330 0.5124 7.6490 5.3963 7.3470 15.8323 2.5323 0.6257 10.4675 8.9236 2.5602 2.5968 8.8314 13.2105 1.8086 14.0355 1.5444 15.3889 20.4267 25.9302 11.4658 4.1637 16.3258 1.4441 4.9237 8.7836
temp: 298.150 k
press: 1.00000 atm
elementType: 46 15 6 6 6 6 1 6 1 6 1 1 1 6 6 6 6 1 6 1 6 1 1 1 6 6 6 6 1 6 1 6 1 1 1 15 6 6 6 6 1 6 1 6 1 1 1 6 6 6 6 1 6 1 6 1 1 1 6 6 6 6 1 6 1 6 1 1 1 6 6 6 6 6 1 1 1 1 1 7 6 8 8 6 6 6 6 1 6 1 6 1 1 1 6 1 1 1 6 6 6 6 6 6 1 1 1 1 1 1 1 1 1
symmnumber: 1
zpe: 2452606.3 jmol-1
zpe.correction: 0.934148 hartree
zpe.thermalcorrener: 0.989236 hartree
zpe.thermalcorrenthalpy: 0.990180 hartree
zpe.thermalcorrgfe: 0.837918 hartree
zpe.sumelectzpe: -3137.312958 hartree
zpe.sumelectthermal: -3137.257871 hartree
zpe.sumelectthermalent: -3137.256927 hartree
zpe.sumelectthermalfe: -3137.409189 hartree
dipole: 5.8149 0.5027 -0.1105
dipole: 5.8377
quadrupole: -321.9461 -322.8371 -322.6808
quadrupole: -9.7917 10.1538 6.0222
quadrupole: 0.5419 -0.3491 -0.1928 -9.7917 10.1538 6.0222
hfenergy: -3138.2471065 hartree
pointgroup: C01 [X(C55H52N1O2P2Pd1)]
dipole: -2.2327031 0.0214494 0.5380388 debye
polarizability: 1065.8497161|-30.4153526|907.8506363|-0.0914983|-15.2460225|949.7408957 unknown
InChI: InChI=1/55C.N.2O.2P.Pd.52H
charge 1 multiplicity 1
113 atoms
Pd 0.19666282 -0.36145896 -0.84720298
P  -1.59515841 -1.21783851 0.30509393
C  -2.98406335 -0.09302728 0.66998703
C  -3.46834461 0.67319344 -0.39777425
C  -3.60816473 -0.01364999 1.91858632
C  -4.54316136 1.53739011 -0.21216999
H  -2.99685819 0.59698375 -1.3794031
C  -4.6905334 0.84701231 2.09901236
H  -3.24665037 -0.61178477 2.7571514
C  -5.15191989 1.63014472 1.04126213
H  -4.89997535 2.14439885 -1.04733556
H  -5.16967785 0.91189444 3.07848342
H  -5.99136115 2.31261478 1.19222111
C  -1.05174884 -1.90483548 1.89902577
C  -0.61545431 -1.01192126 2.89022661
C  -0.90569776 -3.28253272 2.10088658
C  -0.05682684 -1.49320386 4.06990001
H  -0.70413232 0.06519007 2.73740722
C  -0.33562313 -3.75858343 3.28211974
H  -1.23362137 -3.99112511 1.33761786
C  0.08759153 -2.86818315 4.26710317
H  0.27416611 -0.78710976 4.83486645
H  -0.22298305 -4.83492416 3.42963743
H  0.53314723 -3.2449404 5.19057038
C  -2.48567886 -2.57305817 -0.54079955
C  -3.52547961 -3.24577039 0.11761596
C  -2.19564596 -2.88842537 -1.86963318
C  -4.24335977 -4.23656062 -0.54555264
H  -3.77776506 -2.99414006 1.15095334
C  -2.92060794 -3.87617345 -2.53563875
H  -1.39979594 -2.34655556 -2.38281059
C  -3.94113341 -4.55405196 -1.87205293
H  -5.04782741 -4.76161233 -0.02565005
H  -2.68476177 -4.11330988 -3.57546601
H  -4.50912221 -5.33041889 -2.38982036
P  0.07599111 1.97826964 -0.29310682
C  1.72806168 2.74855566 -0.52086394
C  1.89938127 4.00019319 -1.12228358
C  2.85890963 2.03623138 -0.0958935
C  3.17901119 4.52875148 -1.29238471
H  1.03458019 4.56420461 -1.47598903
C  4.13325569 2.57557087 -0.24789529
H  2.74902437 1.0435813 0.34942444
C  4.29722038 3.82153475 -0.85357382
H  3.29904894 5.50192094 -1.77398773
H  5.00211013 2.01246814 0.09608882
H  5.29901746 4.23560232 -0.98946525
C  -0.28150923 2.32949151 1.47473267
C  0.74231899 2.26924209 2.43178351
C  -1.59351031 2.57417132 1.90152031
C  0.45753272 2.44062537 3.78437618
H  1.77405657 2.08836753 2.12854327
C  -1.87304349 2.74994204 3.25604503
H  -2.40812712 2.62893447 1.17801718
C  -0.85225568 2.67842876 4.20202583
H  1.26753956 2.3880968 4.51529375
H  -2.90248512 2.93732655 3.56875533
H  -1.07543301 2.81132191 5.26299166
C  -1.07457827 3.04933773 -1.21310001
C  -1.43259245 4.33036346 -0.77038713
C  -1.5997707 2.5679033 -2.41727484
C  -2.30908555 5.10841652 -1.52311009
H  -1.03289698 4.72047857 0.16842863
C  -2.47050274 3.34973749 -3.17315326
H  -1.33220055 1.56251783 -2.75196287
C  -2.82862519 4.62012402 -2.72339513
H  -2.58856916 6.10342719 -1.16969438
H  -2.87590728 2.96070346 -4.10969104
H  -3.51781291 5.23314405 -3.30873778
C  3.06617604 -2.80468086 -2.20643381
C  3.21572864 -1.75896291 -0.000653
C  1.90311053 -2.01598106 0.23281963
C  0.96676802 -2.32589972 -0.83741264
C  1.57438648 -2.44677626 -2.22828362
H  3.49244225 -2.58489901 -3.194126
H  3.89630434 -1.42937756 0.78342035
H  1.5468286 -1.96414999 1.26342958
H  0.21094549 -3.08107534 -0.59873078
H  1.06689341 -3.257082 -2.76967924
N  3.77200967 -1.93901069 -1.25744459
C  4.98880677 -1.42689617 -1.63133471
O  5.48726305 -0.62538879 -0.66706291
O  5.53420563 -1.65534962 -2.68216657
C  6.6636618 0.06213607 -0.90217227
C  7.70205194 -0.11274639 0.005778
C  6.76572282 0.96148753 -1.96129625
C  8.87091372 0.6321833 -0.14983572
H  7.58179888 -0.82335158 0.82548715
C  7.94080928 1.6949854 -2.10893032
H  5.93164758 1.08932162 -2.65267021
C  8.99362748 1.53415394 -1.20633267
H  9.68993662 0.50352458 0.56134815
H  8.02987354 2.4039391 -2.93519347
H  9.91023691 2.11570074 -1.32617419
C  3.3071075 -4.26790917 -1.86501947
H  4.38382647 -4.48927211 -1.87433591
H  2.90791468 -4.51452539 -0.86986829
H  2.81505531 -4.9152448 -2.60470745
C  1.74907836 1.28050197 -3.46254852
C  1.82329894 0.04903344 -2.59231656
C  1.2724952 -1.1522196 -2.96237056
C  0.47787397 -1.29109381 -4.23013472
C  0.13985768 0.02315513 -4.91341212
C  1.33858066 0.95945974 -4.89408249
H  2.57462746 0.06366297 -1.79959361
H  1.05298622 2.02004619 -3.03911419
H  1.09592639 -1.92145926 -4.89895646
H  -0.43013032 -1.88798507 -4.0502275
H  -0.19420053 -0.17082348 -5.94368913
H  -0.71113429 0.49911 -4.39850571
H  2.18074249 0.47671301 -5.42029108
H  1.11784024 1.89056761 -5.43778272
H  2.73335129 1.77466687 -3.43893283
