program: Gaussian 16
title: Title
version: ES64L-G16RevC.01
method: RPBE1PBE
basis: def2SVP
operation: Freq
keyword: #N
keyword: Geom=AllCheck
keyword: Guess=TCheck
keyword: SCRF=Check
keyword: GenChk
keyword: RPBE1PBE/def2SVP
keyword: Freq
converged: YES YES NO NO
title: Mulliken charges:
elementType: Pd C C C C C C H H H H H H H H H P C C C C H C H C H H H C C C C H C H C H H H C C C C H C H C H H H P C C C C H C H C H H H C C C C H C H C H H H C C C C H C H C H H H
charge: 0.156098 0.011058 -0.103779 -0.219308 0.037193 -0.064678 -0.067689 0.062772 0.049806 0.073217 0.063999 0.037036 0.049410 0.042494 0.040165 0.048135 0.391777 -0.151216 -0.020351 -0.010189 -0.025482 0.047348 -0.005188 0.043120 -0.021735 0.039354 0.038816 0.042927 -0.174914 -0.025735 -0.007082 -0.014824 0.058564 -0.019129 0.043966 -0.018409 0.045009 0.045797 0.049025 -0.196267 -0.012441 -0.017137 -0.021379 0.056701 -0.022194 0.075085 -0.015138 0.047153 0.046342 0.049607 0.390980 -0.148990 -0.009217 0.001479 -0.028992 0.061312 -0.029485 0.043708 -0.014704 0.044921 0.043808 0.047079 -0.129740 -0.039234 -0.010560 -0.016799 0.064974 0.000393 0.039487 -0.015651 0.044389 0.042025 0.046694 -0.181578 -0.002579 -0.041304 -0.021659 0.059564 -0.009025 0.066386 -0.008081 0.051981 0.047392 0.053312
chargesum: 1.00000
title: Mulliken charges with hydrogens summed into heavy atoms:
elementType: Pd C C C C C C P C C C C C C C C C C C C C C C C C C P C C C C C C C C C C C C C C C C C C
charge: 0.156098 0.108999 -0.041007 -0.219308 0.174409 0.021769 0.014970 0.391777 -0.151216 0.026997 0.032931 0.013872 0.033628 0.021191 -0.174914 0.032828 0.036884 0.030185 0.026668 0.030616 -0.196267 0.044260 0.057947 0.025775 0.024149 0.034469 0.390980 -0.148990 0.052095 0.045187 0.015929 0.014323 0.032375 -0.129740 0.025740 0.028926 0.027591 0.042419 0.031043 -0.181578 0.056985 0.025082 0.030322 0.038367 0.045231
1716.lowfreq: -14.4825 -6.1168 -0.0013 -0.0010 0.0009 6.4488 13.7373 19.8304 21.9480
frequency: 13.5833 19.4558 21.7643 29.8593 33.6038 35.5777 39.4162 44.9429 45.8468 51.2145 57.0343 61.7517 65.1407 71.3539 77.5203 80.5523 84.6021 89.7100 97.3631 99.0590 116.2761 121.2035 143.2781 149.6745 197.7746 202.3666 205.6426 206.9378 209.6317 219.0364 230.7548 235.6678 239.4803 253.8990 256.5405 262.3970 262.5826 266.3354 282.3047 285.1610 305.4393 409.3251 411.5730 412.2058 412.6798 420.9469 423.4227 426.2355 429.8161 435.5795 444.7444 457.5174 462.7083 471.8549 480.2865 503.8561 504.7935 518.2835 520.6935 529.4996 531.4686 548.4472 626.3385 627.2987 627.4515 627.9669 628.6780 629.6842 703.2645 704.6913 717.1516 718.4727 719.2971 720.7126 722.0040 722.9730 726.2657 727.1667 728.5296 731.1508 732.8284 764.5829 767.4136 770.5018 771.6850 776.8815 777.3134 788.7202 829.7665 862.5890 865.3144 869.0287 870.2174 873.1225 878.5939 883.5051 921.1303 930.4531 949.7712 950.9044 951.5035 954.3290 956.5264 962.8204 972.0913 1007.6146 1010.4091 1012.4025 1014.0187 1014.2815 1014.6751 1014.8190 1015.7266 1016.2734 1016.7281 1018.0757 1019.0867 1023.8790 1034.5906 1036.1721 1037.7340 1040.1551 1041.4353 1044.8779 1056.5047 1059.2394 1059.6437 1060.4574 1060.6698 1061.0151 1061.4493 1076.7462 1091.2755 1107.1847 1110.6659 1110.9709 1111.9428 1114.3624 1114.8609 1128.7262 1131.0527 1131.8413 1135.4309 1137.4313 1138.2444 1139.0290 1166.9534 1167.3503 1168.1001 1168.2640 1168.4494 1168.7057 1190.7387 1193.0145 1196.5147 1197.3213 1199.2160 1201.5957 1203.3436 1247.3963 1272.1095 1290.9412 1320.3030 1323.7885 1324.8533 1329.8626 1331.9052 1332.5997 1347.7324 1351.3799 1368.9307 1378.9697 1389.5389 1389.8137 1390.5024 1392.6587 1394.0183 1394.5009 1422.3296 1428.1008 1447.2887 1458.6497 1471.4287 1471.5771 1473.3250 1473.5538 1476.9805 1477.3757 1517.5537 1519.0227 1519.4542 1520.6837 1521.1808 1521.6499 1653.7009 1654.4775 1655.6648 1655.7230 1657.8369 1658.3689 1670.5759 1670.6851 1671.5045 1672.0588 1672.8475 1673.5614 1697.4792 3024.1391 3042.0964 3050.5402 3055.1850 3089.3236 3095.4151 3113.9964 3118.5141 3158.4519 3197.6201 3200.6982 3202.4555 3208.4530 3210.1667 3211.2720 3212.2677 3212.3992 3215.1558 3216.0253 3216.0681 3217.3865 3219.0963 3219.8977 3222.5871 3222.8621 3223.1098 3225.6620 3226.2216 3227.3574 3228.8134 3228.8306 3229.8627 3233.5209 3233.7422 3234.0769 3234.7390 3235.1664 3236.9377 3247.1784
redmass: 5.1757 4.6252 4.6501 4.2993 4.5354 4.6934 5.4530 4.7820 4.4041 5.0103 4.8842 4.9749 4.9911 4.9159 5.1665 4.8714 3.6070 4.7255 4.4905 4.8046 5.6190 4.7280 6.7417 2.9851 4.8361 4.9338 4.3565 5.2597 4.4836 4.5329 4.6959 4.1243 4.6915 5.0769 4.8299 5.4700 4.9199 5.0990 4.9234 4.9071 1.8125 2.8443 2.8260 2.8462 2.8670 2.9171 2.4533 3.0991 5.5048 5.5873 5.9953 5.5028 5.3413 4.9018 2.6169 5.8074 5.1296 4.3036 4.9359 3.6014 4.2741 5.3174 6.3653 6.3832 6.3722 6.3690 6.3720 6.3794 6.3405 6.1994 1.7996 1.9557 2.0160 2.5700 2.2874 3.5117 3.3081 2.5821 1.9146 2.2898 4.2426 1.7925 1.8353 1.7939 1.8520 1.9163 1.9648 1.2664 1.4550 3.0918 1.2515 1.2522 1.2535 1.2473 1.2382 1.2338 1.3976 2.3530 2.1376 1.4812 1.3841 1.3636 1.3597 1.3400 1.3225 1.5140 1.3952 1.4052 2.0415 5.5506 2.9230 3.9496 4.3022 3.5786 3.2995 3.6995 1.8865 1.4134 1.3326 1.3389 1.3366 1.3396 1.3393 1.3400 1.6225 2.3634 2.4893 2.4926 2.5011 2.5292 2.4618 1.8121 1.3294 1.4842 1.4966 1.4983 1.5524 1.5294 1.5206 2.9916 2.9527 2.8861 2.8404 2.6821 2.8109 1.1711 1.0624 1.0638 1.0667 1.0651 1.0640 1.0657 1.4825 1.1284 1.1151 1.1125 1.1152 1.1145 1.1172 1.3195 1.1819 1.2330 1.3618 1.3849 1.3865 1.3403 1.3505 1.3419 1.5362 1.8621 1.5877 1.6890 5.7915 5.9475 6.1430 6.8659 6.8751 7.0926 1.0964 1.0970 1.0959 1.1187 2.3883 2.3868 2.3993 2.3899 2.4327 2.4268 2.2910 2.2645 2.2840 2.2490 2.2548 2.2628 6.1227 6.0933 6.2143 6.1732 6.2791 6.2665 6.2284 6.2882 6.2863 6.2450 6.3180 6.2777 7.8888 1.0689 1.0670 1.0672 1.0626 1.0956 1.0969 1.1010 1.1058 1.0903 1.0905 1.0896 1.0882 1.0863 1.0866 1.0878 1.0878 1.0871 1.0885 1.0894 1.0893 1.0892 1.0918 1.0920 1.0931 1.0933 1.0925 1.0936 1.0966 1.0966 1.0962 1.0966 1.0968 1.1010 1.1009 1.0992 1.1010 1.1011 1.1011 1.0952
irintensity: 0.0357 0.0878 0.1359 0.1245 0.0056 0.0836 0.4088 0.0446 0.0035 0.3301 0.0528 0.1061 0.0957 0.4345 1.2546 0.1835 0.2046 0.1576 0.2735 1.3092 0.5926 0.0329 0.9074 0.3970 3.8730 2.3532 1.8543 1.4544 11.5596 1.7450 0.5391 5.0920 3.1413 2.9658 1.9218 2.3289 1.4078 2.0605 1.8592 1.4915 4.4868 0.1523 0.5803 0.3933 0.2944 0.9576 11.3746 2.9824 26.4986 22.2746 13.4283 24.6169 12.8093 20.3903 1.0897 98.4149 29.8079 97.1201 106.6588 82.5176 119.2914 115.9165 0.3190 0.4444 0.9873 0.9323 0.9915 1.8159 16.7124 11.1596 126.6119 30.6504 12.6848 110.6440 32.0717 26.6659 51.9265 22.2750 32.6950 36.1277 18.9490 10.2960 25.4176 7.6722 17.9707 13.9805 20.6032 30.2046 13.1522 0.6300 3.7180 1.2085 0.1345 0.6106 0.3594 0.9362 8.6819 10.9927 1.5350 1.3290 3.2136 0.0465 1.6103 0.6374 2.1933 7.1503 0.6501 1.1331 3.2930 2.0942 1.4726 14.3233 4.2393 34.4006 21.1532 19.6738 1.5419 0.8040 0.1906 0.2040 0.4393 0.0292 0.0467 0.4672 6.4523 11.6189 4.9913 2.8928 6.1407 2.4910 7.1491 1.5349 4.1194 1.8459 3.5228 11.4087 3.1661 4.0675 8.8936 62.0074 28.6242 36.9589 98.2741 44.9044 34.2094 16.0962 0.1719 0.0603 0.0795 0.1451 0.0773 0.0724 8.2390 13.4215 13.2395 6.3437 9.0845 4.9000 10.5754 9.3957 10.0554 0.2332 4.3106 17.7446 2.3921 11.8366 5.7192 8.8341 20.1340 49.2748 15.4730 0.2914 1.2542 0.2651 0.8996 0.8753 0.4810 0.9210 9.0015 23.7619 7.6501 1.7771 40.5668 21.7493 37.5525 33.9944 70.6969 31.4046 18.6223 18.6647 2.7095 16.6447 20.7733 8.9274 1.3719 0.9290 0.9693 2.1842 0.7269 4.8013 0.0381 0.1465 1.6724 0.2889 0.5283 1.1658 21.8428 45.8631 23.6020 49.9959 34.0035 52.5812 24.7463 60.3166 49.5051 10.1755 3.8256 2.4468 3.0783 0.2111 0.2917 0.1433 0.0140 0.1974 0.8105 4.8722 2.2190 0.6495 1.1488 2.0760 2.4837 2.4973 0.8597 9.3677 10.0251 11.1048 5.2447 9.8985 7.8090 20.5238 11.9915 17.9621 13.7211 14.8771 12.5096 6.3063
temp: 298.150 k
press: 1.00000 atm
elementType: 46 6 6 6 6 6 6 1 1 1 1 1 1 1 1 1 15 6 6 6 6 1 6 1 6 1 1 1 6 6 6 6 1 6 1 6 1 1 1 6 6 6 6 1 6 1 6 1 1 1 15 6 6 6 6 1 6 1 6 1 1 1 6 6 6 6 1 6 1 6 1 1 1 6 6 6 6 1 6 1 6 1 1 1
symmnumber: 1
zpe: 1817985.1 jmol-1
zpe.correction: 0.692434 hartree
zpe.thermalcorrener: 0.733701 hartree
zpe.thermalcorrenthalpy: 0.734645 hartree
zpe.thermalcorrgfe: 0.614129 hartree
zpe.sumelectzpe: -2430.351453 hartree
zpe.sumelectthermal: -2430.310187 hartree
zpe.sumelectthermalent: -2430.309243 hartree
zpe.sumelectthermalfe: -2430.429759 hartree
dipole: -0.7767 -1.1181 0.2982
dipole: 1.3937
quadrupole: -239.8388 -249.5060 -236.4338
quadrupole: -1.9649 -2.1327 -4.7910
quadrupole: 2.0874 -7.5798 5.4924 -1.9649 -2.1327 -4.7910
hfenergy: -2431.0438874 hartree
pointgroup: C01 [X(C42H39P2Pd1)]
dipole: -0.4676891 0.2758298 0.0764222 debye
polarizability: 783.2224142|-28.6021441|674.581738|24.8691261|-18.5512335|755.1640204 unknown
InChI: InChI=1/42C.2P.Pd.39H
charge 1 multiplicity 1
84 atoms
Pd -0.20781059 -0.8442598 -0.7543114
C  4.02056202 -1.42859201 -1.2965782
C  2.64786952 -1.13234739 -0.75696561
C  1.61361941 -0.79032073 -1.53893461
C  1.72497277 -0.584191 -3.02207385
C  3.18481928 -0.47698796 -3.46471489
C  4.03214262 -1.56249663 -2.81462616
H  2.52814746 -1.18302546 0.33230862
H  4.69523235 -0.61036699 -0.97767027
H  1.22204448 -1.4166829 -3.54729108
H  1.17180583 0.32238761 -3.3185609
H  3.24883253 -0.53130857 -4.56289667
H  3.57064182 0.51427361 -3.16905824
H  3.62965883 -2.55138403 -3.09733029
H  5.067057 -1.52716058 -3.18961797
H  4.42147897 -2.33904368 -0.81993721
P  -2.44371652 -1.18745648 0.14456057
C  -3.25726128 0.06149564 1.20453847
C  -3.85893803 1.18515346 0.619268
C  -3.25533208 -0.06610446 2.5979341
C  -4.46108956 2.15444315 1.41689008
H  -3.87224582 1.30292251 -0.46552213
C  -3.85539361 0.91007051 3.39155217
H  -2.78952558 -0.93322657 3.07023779
C  -4.46275615 2.01870231 2.80504695
H  -4.93183614 3.02101387 0.94691044
H  -3.84622733 0.79974595 4.478188
H  -4.93455058 2.78022619 3.43024503
C  -2.40719173 -2.69198124 1.1827158
C  -1.26750517 -2.92330442 1.96585973
C  -3.47103046 -3.60096146 1.22900031
C  -1.20012122 -4.04047671 2.7965495
H  -0.42892894 -2.22257614 1.92889211
C  -3.39582088 -4.72157016 2.05401491
H  -4.36000858 -3.4377471 0.61596065
C  -2.26397159 -4.94129013 2.84017963
H  -0.30990317 -4.20959563 3.40644812
H  -4.22833582 -5.42834261 2.08245708
H  -2.20937049 -5.8209365 3.48575243
C  -3.67162357 -1.53899214 -1.15982466
C  -5.04972303 -1.38002669 -0.96152027
C  -3.20502995 -2.00652807 -2.39597965
C  -5.94359836 -1.68198145 -1.98702039
H  -5.4273912 -1.01244814 -0.00487902
C  -4.10172243 -2.30955609 -3.41875211
H  -2.13125474 -2.13108832 -2.56612275
C  -5.47183782 -2.14497502 -3.21573105
H  -7.01609263 -1.55309353 -1.8246153
H  -3.72706355 -2.66947518 -4.37946832
H  -6.17508037 -2.37588119 -4.01921194
P  0.02374821 1.34525173 -0.41647513
C  1.5917363 2.19623308 -0.80704522
C  1.7849192 2.72991539 -2.08768308
C  2.63110217 2.25572926 0.12956306
C  3.00765695 3.30629584 -2.42803966
H  0.97842755 2.70520931 -2.82364669
C  3.84961086 2.83423257 -0.21575747
H  2.49279981 1.85205374 1.13426142
C  4.0425178 3.35670171 -1.4955201
H  3.14802437 3.7208813 -3.42875647
H  4.65321756 2.87937332 0.52267152
H  4.99979759 3.80947933 -1.76357836
C  -0.23283714 1.62924894 1.36873001
C  0.39758969 0.74284227 2.25476059
C  -1.00303856 2.67833601 1.87941991
C  0.28126513 0.92094848 3.63059223
H  0.98252976 -0.09551011 1.86796553
C  -1.12274904 2.84675081 3.25753989
H  -1.53400181 3.3565967 1.21197769
C  -0.47730945 1.97700991 4.1342171
H  0.77929393 0.22532339 4.30941998
H  -1.7377241 3.66125929 3.64559736
H  -0.57789358 2.1132455 5.21333648
C  -1.20636843 2.27956593 -1.37760798
C  -1.30219408 3.67485427 -1.26407206
C  -2.03732394 1.60376146 -2.27810695
C  -2.25951448 4.36823098 -1.99957782
H  -0.62056153 4.22690362 -0.61323892
C  -2.9872055 2.30264277 -3.02094838
H  -1.94076457 0.52233941 -2.39722822
C  -3.10815723 3.6830699 -2.87147311
H  -2.33746353 5.4527633 -1.89741005
H  -3.63333067 1.76223499 -3.71609461
H  -3.85655418 4.23225391 -3.44727202
