program: Gaussian 16
title: Title
version: ES64L-G16RevA.03
method: RPBE1PBE
basis: def2SVP
operation: Freq
keyword: #N
keyword: Geom=AllCheck
keyword: Guess=TCheck
keyword: SCRF=Check
keyword: GenChk
keyword: RPBE1PBE/def2SVP
keyword: Freq
converged: YES YES NO NO
title: Mulliken charges:
elementType: C C C C C H H H H H N C O O C C C C H C H C H H H C H H H Pd C C C C C C H H H H H H H H H P C C C C H C H C H H H C C C C H C H C H H H C C C C H C H C H H H
charge: 0.009726 0.104522 -0.023064 -0.189496 0.073045 0.069435 0.076159 0.076923 0.120899 0.046431 -0.329472 0.409037 -0.328360 -0.299644 0.149797 -0.021895 -0.017450 -0.043495 0.039607 -0.041210 0.036462 -0.018004 0.047447 0.047171 0.043895 0.018524 0.056948 0.052973 0.060746 0.105966 0.043438 -0.088263 -0.295981 0.088959 -0.086333 -0.063217 0.103709 0.086405 0.064927 0.072610 0.048170 0.075769 0.049391 0.048635 0.061897 0.447140 -0.175426 -0.029538 -0.004402 -0.015927 0.071114 -0.018755 0.048617 -0.014419 0.048414 0.048079 0.051296 -0.202122 -0.014397 -0.004971 -0.018827 0.082461 -0.021319 0.056754 -0.012122 0.047250 0.049629 0.051743 -0.169127 -0.008034 -0.026570 -0.020016 0.050979 -0.022189 0.052863 -0.015898 0.046598 0.047891 0.049495
chargesum: 1.00000
title: Mulliken charges with hydrogens summed into heavy atoms:
elementType: C C C C C N C O O C C C C C C C Pd C C C C C C P C C C C C C C C C C C C C C C C C C
charge: 0.079161 0.180682 0.053860 -0.068597 0.119475 -0.329472 0.409037 -0.328360 -0.299644 0.149797 0.017712 0.019012 0.003951 0.005961 0.025891 0.189190 0.105966 0.191740 0.015446 -0.295981 0.226496 0.037607 0.034809 0.447140 -0.175426 0.041576 0.044215 0.032487 0.029323 0.036877 -0.202122 0.068063 0.051783 0.028423 0.028310 0.039621 -0.169127 0.042945 0.026293 0.026582 0.025702 0.033597
1716.lowfreq: -10.1065 -4.8123 -3.2108 0.0005 0.0009 0.0010 7.5407 11.1884 18.1517
frequency: 6.2546 10.6185 18.1212 22.1508 24.5448 28.9382 35.0594 41.0419 48.4605 53.5335 55.5821 57.3919 68.3037 68.7750 80.4718 83.7616 92.2158 101.0498 122.2618 146.1827 163.5280 171.2056 181.8227 190.0148 195.5000 207.3164 219.8478 225.0142 226.9073 249.4974 252.1353 259.5105 262.8844 277.9379 281.8948 291.9472 324.8385 368.2084 401.6300 410.6353 411.4745 412.9792 417.8475 428.0727 435.7619 446.4588 449.8255 466.3843 469.0319 488.8660 503.5489 505.5056 518.1618 520.6066 536.8920 539.9765 570.2193 605.3677 624.0074 626.4100 626.4994 626.9345 627.8913 654.6469 668.3791 704.7726 716.1413 717.9060 720.2240 721.9181 723.5101 726.6967 731.0362 768.2397 769.8650 771.3379 772.1784 777.2855 782.4248 796.1033 821.2136 831.7892 852.4441 853.2925 868.2778 872.5249 873.6293 875.4206 878.8196 894.3362 915.6603 926.9692 949.9582 954.8411 958.4194 959.1713 961.1370 969.3310 976.4790 995.9668 1003.6128 1013.7737 1014.4584 1014.5539 1014.9802 1015.5712 1016.7745 1018.8819 1020.3673 1029.9363 1039.8225 1041.5152 1042.2882 1045.4109 1051.3328 1058.2544 1058.8356 1059.0441 1059.4021 1077.0138 1090.5187 1095.6599 1101.9753 1107.6277 1108.4169 1110.7273 1115.6829 1132.5999 1135.1144 1136.0426 1137.3008 1152.6912 1159.5157 1163.3780 1167.6818 1168.1737 1169.3238 1170.1377 1172.8399 1184.2273 1192.6990 1194.7121 1197.3546 1214.9485 1254.5835 1269.9526 1276.2160 1288.7155 1297.3239 1320.1795 1320.8013 1322.6010 1326.3615 1328.6962 1334.3386 1347.5966 1360.2216 1371.9044 1377.1794 1381.2606 1386.5568 1389.1362 1390.3844 1391.7471 1393.7530 1399.2807 1409.2960 1418.8300 1423.5939 1431.1645 1452.6254 1456.7816 1458.5094 1471.5614 1473.3394 1475.2061 1476.7837 1476.9430 1493.8656 1518.0684 1518.4772 1518.9015 1537.7786 1648.0676 1653.7587 1654.9804 1657.2711 1670.2990 1671.3190 1672.0808 1680.6452 1685.0128 1687.4547 1843.3397 3033.2338 3034.9733 3047.5720 3060.2338 3065.1992 3102.4053 3104.9615 3124.3231 3125.8541 3127.8424 3136.2557 3155.3372 3168.2881 3172.9993 3191.1379 3196.2428 3197.0871 3205.0908 3211.3016 3212.6251 3213.2137 3213.2793 3218.5396 3220.5972 3220.7833 3221.3221 3222.0809 3227.6294 3227.6565 3228.5022 3229.1762 3235.1199 3235.2774 3235.5087 3235.8028 3239.0632 3266.8560
redmass: 5.9505 6.1615 4.8623 4.2955 4.1712 4.8466 4.4654 4.8880 5.2921 5.7277 4.7171 5.2122 6.2966 4.8622 5.7352 4.9252 5.9349 3.9183 3.5287 5.4305 4.3722 3.9365 3.5383 5.0161 4.6184 5.0213 3.1459 2.5516 4.3893 1.3281 5.1221 4.4335 4.1926 5.4741 4.9540 4.1727 1.8496 3.9459 3.6875 2.8394 2.8556 5.7174 2.8621 2.9203 5.7965 5.7899 4.0041 4.5316 3.1123 3.4530 5.1811 3.6404 4.5243 3.6017 4.6090 4.1424 3.2791 6.4685 4.1791 6.3829 6.3835 6.3780 6.3758 3.9637 4.1192 6.3026 2.2017 2.0664 1.7070 1.9758 2.0252 3.1218 6.2364 1.7978 2.4744 1.8383 2.0256 1.9567 2.2610 2.8159 1.3553 3.9352 1.2515 1.5638 3.7469 1.2492 1.2464 1.2487 3.2404 2.4451 2.0429 1.5087 1.6900 1.3864 1.3867 1.8796 1.3711 1.4770 1.8350 2.3269 1.3679 2.0460 4.0968 2.6550 2.0627 2.2920 1.4308 1.7314 3.0890 1.3339 1.3397 1.3434 1.3427 1.9923 2.0405 2.3813 2.3195 2.4697 1.8765 1.6202 1.8550 1.3596 1.3525 1.4895 1.5002 1.4927 2.4569 2.9835 2.4909 2.6757 2.9735 1.2107 1.4700 1.0868 1.0650 1.0670 1.0670 1.3074 1.4037 1.4200 1.1141 1.1168 1.1124 1.5877 1.3273 1.6670 3.0536 1.2593 2.1038 1.3469 1.3826 1.2876 1.3509 1.3532 1.4204 1.4143 1.7320 1.5167 1.7534 1.7626 1.6483 5.7016 1.5486 6.1582 7.1388 6.6902 4.1532 2.0843 1.2086 1.0865 1.0970 1.1110 1.0931 2.3835 2.3942 2.2737 2.1911 1.1597 2.5665 2.2727 2.2800 2.2737 2.7781 6.1513 6.1210 6.1880 6.2813 6.2304 6.2594 6.2764 6.9449 6.7166 6.3817 12.6711 1.0691 1.0703 1.0681 1.0656 1.0367 1.0952 1.0966 1.0993 1.0878 1.1032 1.0879 1.0887 1.1040 1.1051 1.0914 1.0912 1.0900 1.0891 1.0882 1.0868 1.0881 1.0876 1.0917 1.0921 1.0909 1.0915 1.0914 1.0966 1.0963 1.0964 1.0948 1.1010 1.1009 1.1009 1.0980 1.1002 1.0962
irintensity: 0.1155 0.1383 0.0066 0.1914 0.0304 0.0969 0.4629 0.0157 0.5105 0.9233 0.6107 0.4775 1.2541 1.4898 3.1749 0.3601 1.9305 0.1824 0.4991 4.3448 1.7576 5.2567 1.0513 2.7486 0.6557 2.8559 0.4457 1.5395 0.9166 0.5915 2.0469 0.9585 0.3688 8.4207 1.1839 1.9834 1.4812 3.6306 41.4837 0.4859 0.2432 21.0045 0.0823 0.0278 14.0943 19.5356 0.9271 14.7011 1.8801 6.8184 62.4291 14.2456 105.9553 18.3760 161.2768 27.7293 11.6806 17.3175 10.9729 2.5751 0.1471 0.9277 0.8574 20.8906 4.5340 13.5023 15.4926 46.4598 77.4047 92.4006 22.3406 21.6896 22.5895 12.0124 108.3011 5.7811 40.4980 16.4151 22.4388 25.8401 1.4299 17.0389 0.2916 16.3073 32.4812 0.6663 0.5868 1.1603 12.3695 55.8871 2.4940 12.0435 7.7935 5.7865 0.7647 14.8063 0.4188 40.0499 34.9136 5.4180 0.1330 16.8173 11.5389 14.1717 18.3281 8.8135 7.5753 204.1624 33.4616 0.1576 0.4434 0.0906 0.0387 62.9299 1.8812 3.2180 11.1749 4.8354 70.0654 26.2575 0.8734 18.0578 4.6379 8.0746 1.3987 5.0323 84.3855 35.4820 107.7495 10.0701 66.9666 22.9912 16.3683 0.1986 0.0146 0.1245 0.2439 2.2663 1.8100 81.2923 10.3087 7.3521 17.6712 2.0923 5.6675 82.9328 623.0903 134.8285 548.5431 0.6335 11.8708 10.6945 1.8034 14.9554 62.5553 58.0499 175.7770 25.8565 55.4398 55.7291 2.1740 0.3422 93.1521 1.1537 2.2382 34.2535 1014.8453 144.1198 34.4692 21.1554 39.6844 6.2732 5.9265 52.4360 33.7573 142.6985 49.7570 4.5676 4.4349 15.7653 16.7327 6.4418 62.4848 33.0904 1.7109 3.9463 3.0529 0.0292 1.7456 3.2159 8.6539 165.8672 636.3920 977.0770 20.4902 17.7257 27.2154 46.7981 18.5394 27.6824 10.4199 52.1050 14.2376 33.4150 3.2133 2.6415 13.4742 13.6913 1.5569 2.0575 1.9499 1.5439 0.0791 0.4480 0.5077 0.3967 0.5328 0.8191 5.4789 1.6393 6.3044 7.1839 11.1979 8.5500 13.6624 18.2146 18.9600 10.8035 3.7556 0.7559 9.1800
temp: 298.150 k
press: 1.00000 atm
elementType: 6 6 6 6 6 1 1 1 1 1 7 6 8 8 6 6 6 6 1 6 1 6 1 1 1 6 1 1 1 46 6 6 6 6 6 6 1 1 1 1 1 1 1 1 1 15 6 6 6 6 1 6 1 6 1 1 1 6 6 6 6 1 6 1 6 1 1 1 6 6 6 6 1 6 1 6 1 1 1
symmnumber: 1
zpe: 1721434.4 jmol-1
zpe.correction: 0.655660 hartree
zpe.thermalcorrener: 0.693811 hartree
zpe.thermalcorrenthalpy: 0.694755 hartree
zpe.thermalcorrgfe: 0.578193 hartree
zpe.sumelectzpe: -2102.725908 hartree
zpe.sumelectthermal: -2102.687757 hartree
zpe.sumelectthermalent: -2102.686813 hartree
zpe.sumelectthermalfe: -2102.803375 hartree
dipole: 6.9960 -0.8029 1.1868
dipole: 7.1413
quadrupole: -211.4374 -225.4755 -231.3447
quadrupole: -8.3419 -5.8843 -2.2222
quadrupole: 11.3152 -2.7230 -8.5922 -8.3419 -5.8843 -2.2222
hfenergy: -2103.3815678 hartree
pointgroup: C01 [X(C37H37N1O2P1Pd1)]
dipole: 2.7005677 0.3841422 0.6731645 debye
polarizability: 774.2366561|1.1161352|580.8202251|36.1922048|4.1755382|608.5425213 unknown
InChI: InChI=1/37C.N.2O.P.Pd.37H
charge 1 multiplicity 1
79 atoms
C  -1.19370999 -1.85331866 -1.21583549
C  -1.28001203 0.59174247 -1.36704633
C  0.06856489 0.67617727 -1.39913755
C  0.93039903 -0.43292628 -1.0013522
C  0.20994239 -1.72096115 -0.61378448
H  -1.74954624 -2.60557614 -0.6404652
H  -1.92209901 1.44287551 -1.59018041
H  0.51659288 1.62211307 -1.71013067
H  1.82347816 -0.57575468 -1.62161735
H  0.79366124 -2.57714771 -0.97642759
N  -1.93225189 -0.5968583 -1.06787945
C  -3.26658307 -0.66832681 -0.76136278
O  -3.79752416 0.56556886 -0.63228516
O  -3.87935823 -1.69558709 -0.60534414
C  -5.14726023 0.67798627 -0.35028871
C  -6.10233545 0.30081059 -1.29031496
C  -5.5096532 1.23386473 0.87194647
C  -7.45078523 0.48349199 -0.99002475
H  -5.78958094 -0.12837639 -2.24374295
C  -6.8620729 1.41733718 1.15854375
H  -4.73087414 1.51865486 1.58195282
C  -7.8335264 1.04105725 0.23111997
H  -8.2084431 0.19009472 -1.72022082
H  -7.15564238 1.8559361 2.11493609
H  -8.89207337 1.18395371 0.45891924
C  -1.15226976 -2.26734986 -2.68023282
H  -2.17305405 -2.37431666 -3.07373941
H  -0.61888144 -1.52086318 -3.28780535
H  -0.63735125 -3.23254194 -2.78830031
Pd 1.66014106 0.06480841 0.85350604
C  -0.43110307 -0.832746 3.16540101
C  -0.34697313 -0.78312554 1.66579085
C  0.26005265 -1.75845258 0.90956822
C  0.91817969 -2.94827682 1.55289521
C  1.18472485 -2.75320017 3.0382749
C  -0.04489873 -2.19137969 3.73775188
H  -0.93644807 -0.00625274 1.1687464
H  0.21381892 -0.037888 3.58543965
H  0.25063825 -3.8158293 1.38880192
H  1.84837889 -3.18431776 1.01118495
H  1.49140386 -3.70755511 3.49199161
H  2.03288049 -2.05570237 3.16642093
H  -0.88530065 -2.89405415 3.60208535
H  0.12331469 -2.10882228 4.82195538
H  -1.45481494 -0.55654632 3.4661042
P  3.52102917 1.18367902 0.07537747
C  4.79048789 1.15725389 1.38206879
C  4.92225115 -0.01556029 2.14054462
C  5.62327445 2.25100752 1.6460193
C  5.89090348 -0.09839999 3.13850947
H  4.26220345 -0.86733072 1.94937253
C  6.58456528 2.16503933 2.65139746
H  5.52048457 3.17344229 1.07080688
C  6.72202556 0.99228563 3.39474704
H  5.9906441 -1.01606006 3.72230694
H  7.23052097 3.02197802 2.85515984
H  7.47693114 0.93039081 4.18196261
C  3.22236574 2.93006786 -0.3328501
C  2.08873259 3.55871169 0.19807253
C  4.10968208 3.66036199 -1.13623803
C  1.84955392 4.90664283 -0.06326295
H  1.38620011 2.98609927 0.810628
C  3.86520363 5.006846 -1.39520126
H  4.99012236 3.17543464 -1.5646688
C  2.73739302 5.63028779 -0.85866558
H  0.96234726 5.39040409 0.35097035
H  4.55881326 5.57236777 -2.02134104
H  2.54725967 6.68566987 -1.06719573
C  4.31810318 0.48661611 -1.40721083
C  5.43223655 -0.35484759 -1.30814217
C  3.74679297 0.73257045 -2.66510592
C  5.9680318 -0.9406452 -2.45404932
H  5.88974643 -0.54978225 -0.3358914
C  4.28746539 0.14449346 -3.80606339
H  2.88705949 1.40073357 -2.76144893
C  5.3972048 -0.69470333 -3.70238134
H  6.84156831 -1.59083898 -2.36853205
H  3.83931716 0.34653471 -4.78141292
H  5.82055394 -1.154625 -4.5981751
