program: Gaussian 16
title: Title
version: ES64L-G16RevC.01
method: RPBE1PBE
basis: def2SVP
operation: Freq
keyword: #N
keyword: Geom=AllCheck
keyword: Guess=TCheck
keyword: SCRF=Check
keyword: GenChk
keyword: RPBE1PBE/def2SVP
keyword: Freq
converged: YES YES NO YES
title: Mulliken charges:
elementType: Pd P C C C C H C H C H H H C C C C H C H C H H H C C C C H C H C H H H P C C C C H C H C H H H C C C C H C H C H H H C C C C H C H C H H H C C C C C H H H H H N C O O C C C C H C H C H H H C H H H C C C C C C H H H H H H H H H
charge: -0.106710 0.373447 -0.178366 -0.055326 -0.011343 0.002304 0.056557 -0.022062 0.059306 -0.009595 0.049223 0.050151 0.051825 -0.099499 -0.058571 -0.023288 -0.014356 0.075026 -0.003211 0.035225 -0.019725 0.042068 0.039203 0.043841 -0.137383 -0.039566 -0.028478 -0.019404 0.054331 -0.023111 0.057262 -0.015425 0.043775 0.044838 0.046959 0.371192 -0.148655 -0.010026 -0.010302 -0.029588 0.057557 -0.002982 0.040188 -0.020062 0.038590 0.037669 0.041963 -0.172417 -0.053672 -0.002333 -0.024293 0.058032 -0.019224 0.058577 -0.011950 0.050050 0.050555 0.051118 -0.158494 -0.054361 0.003844 -0.009939 0.072521 -0.012965 0.037776 -0.020367 0.044711 0.040473 0.046206 -0.047770 0.055602 -0.028666 -0.123075 0.036576 0.069842 0.137357 0.144767 0.116923 0.076844 -0.306430 0.414092 -0.340752 -0.298815 0.171940 -0.004306 -0.013453 -0.040975 0.031488 -0.036600 0.019476 -0.019181 0.045106 0.041171 0.042387 0.020298 0.063475 0.063111 0.055613 0.015578 -0.159522 -0.124151 0.029300 -0.086267 -0.039812 0.035953 0.043301 0.049188 0.061045 0.038076 0.067350 0.039536 0.036832 0.048235
chargesum: 1.00000
title: Mulliken charges with hydrogens summed into heavy atoms:
elementType: Pd P C C C C C C C C C C C C C C C C C C P C C C C C C C C C C C C C C C C C C C C C C C N C O O C C C C C C C C C C C C C
charge: -0.106710 0.373447 -0.178366 0.001231 0.047963 0.051527 0.028089 0.042230 -0.099499 0.016456 0.011938 0.027712 0.035992 0.024115 -0.137383 0.014765 0.028783 0.024372 0.021726 0.031535 0.371192 -0.148655 0.047531 0.029886 0.009002 0.034687 0.021901 -0.172417 0.004360 0.056243 0.025757 0.031330 0.039168 -0.158494 0.018160 0.041619 0.034771 0.027508 0.025839 0.022072 0.192959 0.116101 -0.006152 0.113420 -0.306430 0.414092 -0.340752 -0.298815 0.171940 0.027183 0.006024 0.004131 0.004571 0.023205 0.202496 0.107115 -0.123569 -0.124151 0.139533 0.019159 0.036556
1716.lowfreq: -2.4783 -0.0020 -0.0015 -0.0011 1.0390 7.4624 17.1116 21.0882 23.0986
redmass: 5.5059 5.0498 5.4209 5.3859 4.8335 5.0890 5.4629 4.5832 5.4329 5.6882 5.3996 5.1709 5.0764 5.5022 5.0684 5.2674 4.1144 5.8238 5.6123 4.6143 7.1652 4.1566 5.7028 4.4489 3.6625 4.2302 5.0391 4.2551 3.8906 4.1303 5.4222 4.6005 3.8928 4.2428 5.2274 5.5456 6.3524 4.8819 4.4394 5.0681 5.3623 4.3316 2.9274 1.4836 2.9982 4.9882 5.2818 4.7162 3.9939 3.5750 4.7641 4.7266 4.7759 3.7218 2.4804 2.9107 4.1819 4.9282 4.3687 2.8690 2.9959 2.9336 2.9110 2.9618 2.9381 4.7510 3.7387 5.9297 6.0642 4.6451 3.7283 5.7634 3.4126 3.9240 6.1715 6.3453 3.7737 4.2184 4.6247 3.6405 3.6040 4.2729 3.7042 4.5463 3.7702 6.8029 6.3343 6.3697 6.3398 6.3564 6.3673 6.0959 4.3379 6.0771 3.6227 2.6499 6.3052 6.3808 4.4222 2.3387 1.8540 3.2399 1.9180 1.8146 1.7073 2.2617 3.4233 6.2203 1.8259 1.7709 1.8119 1.9136 2.1646 1.8563 3.3593 2.4253 1.9661 2.4995 1.7391 1.3579 2.8794 1.2501 1.7511 1.2491 1.2543 2.3891 1.7488 1.8528 1.3594 1.2505 1.2351 1.9760 1.7263 1.4168 1.3569 1.3501 1.3517 1.7254 2.0276 1.3726 1.3596 1.3368 1.3252 2.1042 1.4182 1.3680 1.4380 1.5479 1.9315 1.6007 2.1682 2.7660 3.9834 4.3401 3.9588 3.5984 3.8087 2.7329 2.0243 1.4765 1.3283 1.3333 1.3324 1.3319 1.3350 1.3377 1.3432 2.2515 1.9977 2.3874 2.4691 2.5838 2.5636 2.5657 2.6131 1.7484 1.8606 1.7420 1.3615 1.4074 1.5077 1.5221 1.5026 1.5069 1.5168 1.9070 1.6567 2.7283 2.8858 2.6797 2.7880 1.8710 2.7620 2.9571 1.7331 1.2364 1.0792 1.2413 1.0622 1.0632 1.0641 1.0637 1.0654 1.0670 1.1349 1.8648 1.1121 1.1108 1.1135 1.1136 1.1118 1.1184 1.5111 1.3870 1.8102 3.0322 1.5080 1.7107 1.3442 1.3450 1.3722 1.3942 1.3804 1.3798 1.3658 1.3371 1.3353 1.5133 1.4417 1.5722 1.6587 1.7445 3.0454 5.4626 4.4716 6.1614 3.2759 2.4461 6.1069 6.9596 7.6054 2.1758 2.1745 1.1089 1.0931 1.1085 1.0851 1.0772 1.1242 2.3603 2.3745 2.4033 2.4063 2.4250 2.4210 2.5715 3.0913 2.2688 2.2976 2.2679 2.2696 2.2773 2.2753 2.8530 5.0541 6.0834 6.1077 6.1941 6.1828 6.2781 6.2489 6.2849 6.2836 6.2570 6.3175 6.2880 6.3261 7.0069 6.8035 7.6162 12.7983 1.0741 1.0814 1.0678 1.0660 1.0369 1.0625 1.0965 1.0917 1.1017 1.1052 1.0955 1.1046 1.0964 1.0905 1.0897 1.0911 1.0878 1.0866 1.0865 1.0870 1.0870 1.0883 1.0884 1.0895 1.0891 1.0897 1.0900 1.0903 1.0916 1.0917 1.0937 1.0932 1.0946 1.0938 1.0944 1.0962 1.0961 1.0962 1.0955 1.0977 1.0992 1.0987 1.0978 1.1009 1.1009 1.0996 1.0970 1.0975 1.0960 1.0941 1.0953 1.0944
irintensity: 0.1327 0.0220 0.0740 0.1800 0.1813 0.0872 0.0533 0.0175 0.5077 0.0562 0.9758 0.1504 0.3482 1.5391 1.0716 0.1326 0.0463 0.7456 0.2255 1.1477 0.3668 0.4624 1.3918 0.1020 0.6190 0.5632 2.1007 0.2337 0.3992 0.3079 1.1945 2.3626 2.6534 1.8314 1.1787 1.7920 2.4200 2.4847 0.9018 1.8409 3.4175 0.2663 0.4798 1.3103 1.0694 5.8746 1.3243 1.2562 2.3757 1.6000 1.4441 3.3759 10.3093 7.7139 9.6823 4.4000 7.2125 41.8954 4.3307 0.5095 1.0839 1.8257 0.2990 1.0176 0.1415 14.4141 9.6684 21.2492 26.7826 5.0811 5.8133 22.7931 18.1152 12.7215 17.8609 103.0710 4.6903 76.5967 125.4303 43.9770 5.9755 149.9204 44.3789 78.6599 0.7971 26.8163 0.7030 4.1293 0.6850 0.3053 1.0274 0.8878 3.4645 2.3121 4.4798 10.4694 12.7149 10.8098 57.5522 75.2611 51.4030 31.7586 31.8764 150.2245 40.3769 42.9340 7.9168 23.7925 29.3398 20.2452 22.8064 19.9556 20.8752 6.2808 87.5664 4.1760 11.2197 3.4511 70.1593 9.9232 4.3992 0.8689 34.8825 1.8921 5.1133 8.6248 4.8711 21.9276 4.1738 1.0554 0.6536 16.9176 61.9378 32.2876 20.7599 0.8224 7.5880 9.9565 13.3407 1.7359 2.8799 0.8747 1.9695 3.0059 60.4816 0.3513 0.7480 6.1502 19.9925 2.8852 1.6074 1.7590 4.6032 6.1640 4.5720 3.5539 4.9246 8.8624 3.7255 0.8483 0.2706 0.2853 0.3950 0.1439 0.1286 0.1434 0.2809 68.2878 10.0503 3.1923 9.5092 4.7902 3.5349 1.9920 4.4056 23.7712 1.0155 29.0603 15.4740 29.7454 2.5804 3.9282 2.7622 5.0082 8.2710 19.1008 32.5859 29.7987 39.6273 35.7425 53.2594 6.3307 25.5104 78.9443 25.8605 7.9780 0.4412 27.7541 0.0909 0.0081 0.1213 0.0189 0.2642 0.2073 4.2958 46.8193 3.2172 7.1646 15.3491 6.2353 2.4541 5.7423 0.9947 4.5182 74.0361 481.4753 163.1718 103.8706 37.8986 11.1692 9.2711 51.2304 48.7698 14.4890 4.6015 9.5110 17.5027 174.1153 13.4954 63.0463 31.2079 39.4581 362.5126 9.9271 22.5579 0.5447 50.5100 159.2817 21.7051 0.7985 14.8771 357.1110 48.8093 1.3757 16.0931 8.4957 18.8413 7.4200 1.6598 21.9940 39.9308 5.9354 36.6960 89.2443 50.4019 4.5213 134.6119 17.4709 4.3184 29.2293 23.3055 11.5466 11.3858 148.1827 269.8246 1.6286 1.0905 0.6263 1.3302 0.7026 5.4205 2.1165 1.4797 0.8209 0.5936 2.0372 4.7541 9.4520 19.9287 7.5906 1085.5864 21.0461 37.7488 42.6674 49.9661 21.1491 32.3224 44.4884 3.8849 49.6467 40.2872 6.8301 10.8590 14.8172 11.9267 3.6737 6.4372 4.5032 0.2148 0.7386 0.4574 0.2095 0.6955 0.8607 1.8646 1.4287 0.9468 1.9859 7.3148 0.3203 9.4955 9.2295 9.9993 10.2172 7.8644 5.3097 6.5876 1.3610 12.6457 5.3199 4.7367 16.5317 13.6256 15.9122 4.0341 21.3854 2.7533 7.0269 10.6701 7.9234 5.8935 18.5177 16.8636
temp: 298.150 k
press: 1.00000 atm
elementType: 46 15 6 6 6 6 1 6 1 6 1 1 1 6 6 6 6 1 6 1 6 1 1 1 6 6 6 6 1 6 1 6 1 1 1 15 6 6 6 6 1 6 1 6 1 1 1 6 6 6 6 1 6 1 6 1 1 1 6 6 6 6 1 6 1 6 1 1 1 6 6 6 6 6 1 1 1 1 1 7 6 8 8 6 6 6 6 1 6 1 6 1 1 1 6 1 1 1 6 6 6 6 6 6 1 1 1 1 1 1 1 1 1
symmnumber: 1
zpe: 2454899.1 jmol-1
zpe.correction: 0.935022 hartree
zpe.thermalcorrener: 0.989615 hartree
zpe.thermalcorrenthalpy: 0.990559 hartree
zpe.thermalcorrgfe: 0.844045 hartree
zpe.sumelectzpe: -3137.324816 hartree
zpe.sumelectthermal: -3137.270223 hartree
zpe.sumelectthermalent: -3137.269279 hartree
zpe.sumelectthermalfe: -3137.415793 hartree
dipole: 3.9835 3.4885 -1.8665
dipole: 5.6144
quadrupole: -318.9127 -344.0012 -311.0154
quadrupole: -16.7372 4.6895 2.7223
quadrupole: 5.7304 -19.3581 13.6277 -16.7372 4.6895 2.7223
hfenergy: -3138.2598375 hartree
pointgroup: C01 [X(C55H52N1O2P2Pd1)]
dipole: 1.6675055 0.683295 -1.2773735 debye
polarizability: 954.8498835|-9.7514724|890.5391391|10.9416309|22.3153733|981.9254139 unknown
InChI: InChI=1/55C.N.2O.2P.Pd.52H
charge 1 multiplicity 1
113 atoms
Pd 0.18461634 -0.69503184 -0.74871386
P  2.45931652 -0.17897491 -0.4841956
C  3.00627213 0.47081416 1.12347626
C  2.0687666 0.5043399 2.16162897
C  4.31717583 0.90524128 1.37273954
C  2.41602026 0.99346747 3.41905281
H  1.05607042 0.14228091 1.97988873
C  4.66282272 1.39747042 2.62892098
H  5.07949082 0.84643082 0.59329474
C  3.712807 1.44838206 3.65091778
H  1.66906513 1.01856386 4.21569683
H  5.68394068 1.73866468 2.81251693
H  3.98980671 1.83545597 4.63410681
C  2.82028191 1.07604732 -1.77435069
C  2.20916808 0.89469063 -3.02474261
C  3.67081918 2.16968308 -1.58829974
C  2.47362092 1.76679958 -4.07741639
H  1.50953229 0.06857678 -3.17597288
C  3.92862649 3.044276 -2.64254907
H  4.12205222 2.36470253 -0.61599082
C  3.34197327 2.84123719 -3.88996926
H  1.99012641 1.60873618 -5.04403209
H  4.58777967 3.89962351 -2.47898816
H  3.54718378 3.5312222 -4.7115895
C  3.65739523 -1.51372346 -0.88244466
C  4.54046184 -2.03598671 0.06959242
C  3.62961395 -2.07941 -2.16610766
C  5.38069508 -3.10054996 -0.2568474
H  4.57206306 -1.62440618 1.07875849
C  4.47027443 -3.14124497 -2.48838853
H  2.94879295 -1.69189487 -2.92702855
C  5.34845958 -3.65655034 -1.53358437
H  6.06257081 -3.49666808 0.49910122
H  4.43687754 -3.56921969 -3.49281391
H  6.00591574 -4.49134474 -1.78658825
P  -0.72045473 1.46157909 -0.41049212
C  0.35333339 2.9439998 -0.51387151
C  1.10966841 3.3313567 0.60075551
C  0.44677951 3.68858142 -1.69515542
C  1.93999934 4.44724626 0.53485051
H  1.04313525 2.77261501 1.53478635
C  1.27710079 4.80566176 -1.75504156
H  -0.13502105 3.40568017 -2.57389442
C  2.02356995 5.18953775 -0.64230094
H  2.52034523 4.73784988 1.41361837
H  1.34060262 5.37802064 -2.68300605
H  2.67310159 6.06637914 -0.69363495
C  -1.44075356 1.61445486 1.26102641
C  -1.514037 0.47700494 2.07165168
C  -1.86529127 2.84861495 1.77442874
C  -1.9987982 0.56403544 3.3758699
H  -1.17486678 -0.48751174 1.6871959
C  -2.36520747 2.93193769 3.07181149
H  -1.78739583 3.75352262 1.16757769
C  -2.42785133 1.79257961 3.8763266
H  -2.04387964 -0.33168358 3.99914477
H  -2.69739268 3.89656625 3.46156332
H  -2.80966136 1.86469712 4.89710153
C  -2.04840179 1.83223526 -1.61254008
C  -1.8393757 1.45427847 -2.94689003
C  -3.24181998 2.46927222 -1.2599074
C  -2.80438117 1.72339357 -3.91484317
H  -0.91663904 0.9416916 -3.23175145
C  -4.20994249 2.72708825 -2.22928807
H  -3.43724173 2.74674863 -0.2234784
C  -3.99335984 2.35955474 -3.55631429
H  -2.62853243 1.42677704 -4.95122704
H  -5.14521398 3.21011995 -1.93825136
H  -4.75559018 2.5615936 -4.31227052
C  -1.83065513 -3.58573873 0.02360185
C  -1.73535084 -1.60710427 -1.41542652
C  -0.60718246 -2.2035418 -2.022894
C  0.27688046 -2.87533203 -1.15951196
C  -0.29465042 -3.62560595 0.04027873
H  -2.20545648 -3.8006148 1.03001112
H  -2.38530437 -0.93336289 -1.97374614
H  -0.33826513 -1.94352399 -3.04909004
H  1.23168126 -3.22351828 -1.56068539
H  -0.02450817 -4.6824425 -0.14585614
N  -2.31061398 -2.24050493 -0.30946649
C  -3.42064481 -1.7478805 0.32236477
O  -3.78347696 -0.57101319 -0.22369189
O  -3.99149226 -2.29128757 1.2368192
C  -4.95878075 0.04172302 0.17166044
C  -5.98904585 0.11517389 -0.75943554
C  -5.06330885 0.6396957 1.42249528
C  -7.15193761 0.80911882 -0.42940065
H  -5.8623141 -0.35568597 -1.73582451
C  -6.23169226 1.32925591 1.74228338
H  -4.23455421 0.57620077 2.1268752
C  -7.27552756 1.41738053 0.820304
H  -7.96382618 0.87752192 -1.15694919
H  -6.32082096 1.80634906 2.72097965
H  -8.18643404 1.96336762 1.07538947
C  -2.43131965 -4.60701905 -0.93589307
H  -2.09120305 -4.44952057 -1.97022763
H  -2.1431191 -5.62315751 -0.63168076
H  -3.52863238 -4.54299587 -0.91703801
C  0.31047531 -2.51162317 3.75355469
C  -0.30665144 -2.76301447 2.40952871
C  0.35800377 -3.28042397 1.36406213
C  1.808434 -3.66523899 1.46628854
C  2.50144099 -3.10208468 2.69873753
C  1.62903374 -3.25341754 3.93601662
H  -1.37112617 -2.52856469 2.31468818
H  0.46638001 -1.424611 3.88769558
H  1.86483125 -4.77058831 1.4661239
H  2.34215222 -3.35295465 0.55542236
H  3.47606626 -3.5949014 2.83862685
H  2.71104332 -2.0313824 2.54172759
H  1.42326082 -4.32453443 4.10810571
H  2.15257035 -2.88402235 4.83144269
H  -0.40772663 -2.79615363 4.54057681
