program: Gaussian 16
title: Title
version: ES64L-G16RevC.01
method: RPBE1PBE
basis: def2SVP
operation: Freq
keyword: #N
keyword: Geom=AllCheck
keyword: Guess=TCheck
keyword: SCRF=Check
keyword: GenChk
keyword: RPBE1PBE/def2SVP
keyword: Freq
converged: YES YES NO YES
title: Mulliken charges:
elementType: Pd P C C C C H C H C H H H C C C C H C H C H H H C C C C H C H C H H H C C C C C H H H H H N C O O C C C C H C H C H H H C H H H C C C C C C H H H H H H H H H C C C C B B O O O O C H H H C H H H C H H H C H H H C H H H C H H H C H H H C H H H
charge: 0.004715 0.386028 -0.175435 -0.008776 -0.023579 -0.003225 0.050884 -0.014566 0.047185 -0.015347 0.042161 0.043730 0.046153 -0.171870 -0.030442 -0.025135 -0.021045 0.057013 -0.015418 0.058047 -0.015199 0.046877 0.044083 0.047131 -0.186168 -0.020252 -0.015236 -0.018913 0.048762 -0.022100 0.052383 -0.015703 0.040255 0.042766 0.045090 -0.076284 0.056214 -0.026407 -0.094671 0.048976 0.078224 0.112708 0.110069 0.124894 0.069849 -0.293123 0.425574 -0.341926 -0.293455 0.184162 -0.009486 -0.034023 -0.036320 0.036256 -0.039686 0.035506 -0.020306 0.043005 0.045310 0.041494 0.018306 0.065930 0.064884 0.057267 0.016658 -0.141602 -0.136007 -0.031940 -0.032202 -0.075467 0.033888 0.053864 0.084697 0.060521 0.041646 0.041884 0.044754 0.040298 0.051693 -0.159945 -0.148641 -0.161226 -0.130355 0.193154 0.243543 -0.345777 -0.250900 -0.279619 -0.287145 0.036543 0.055782 0.058395 0.064906 -0.012027 0.071564 0.063145 0.091197 0.020092 0.057817 0.060214 0.054841 0.039751 0.049883 0.058699 0.054343 0.021834 0.056591 0.055448 0.055068 0.041687 0.047674 0.056452 0.051338 -0.002469 0.055983 0.079393 0.070719 0.027241 0.056392 0.058126 0.059807
chargesum: 1.00000
title: Mulliken charges with hydrogens summed into heavy atoms:
elementType: Pd P C C C C C C C C C C C C C C C C C C C C C C C N C O O C C C C C C C C C C C C C C C C C B B O O O O C C C C C C C C
charge: 0.004715 0.386028 -0.175435 0.042109 0.023606 0.038935 0.029164 0.030806 -0.171870 0.026571 0.032912 0.025832 0.028665 0.031932 -0.186168 0.028510 0.037147 0.021342 0.020665 0.029387 0.001939 0.168922 0.083662 0.030223 0.118825 -0.293123 0.425574 -0.341926 -0.293455 0.184162 0.026770 0.001483 0.006685 0.005624 0.021187 0.206387 0.122215 -0.107715 -0.136007 0.113279 0.051329 0.009585 -0.159945 -0.148641 -0.161226 -0.130355 0.193154 0.243543 -0.345777 -0.250900 -0.279619 -0.287145 0.215626 0.213880 0.192963 0.202676 0.188941 0.197152 0.203626 0.201566
chargesum: 0.99999
1716.lowfreq: -10.4450 -5.2942 -0.0010 -0.0005 0.0008 8.7070 15.7248 18.9233 22.0266
redmass: 4.9240 4.8658 3.9148 4.8362 4.9167 4.1283 4.5621 4.7094 4.9500 4.5997 3.9310 4.7524 5.5556 4.3565 4.6526 4.6816 5.6958 4.8284 4.2940 5.2261 4.7625 5.5471 4.8118 4.6417 3.8515 3.6914 4.6305 4.5461 6.0168 4.2338 6.3841 4.4348 4.6625 4.8281 4.8220 3.1821 4.5847 3.5906 2.7165 5.1516 4.6014 4.1497 4.3535 1.1983 1.2264 1.2394 1.1634 4.4013 4.0995 2.5859 1.6230 4.7226 2.0523 4.3341 2.0945 3.1196 1.8004 1.5140 1.5961 1.1537 2.2200 1.3189 2.1135 1.1705 2.1552 2.1691 2.2047 3.9608 2.2649 2.2667 3.5653 4.8635 2.8508 3.1021 3.6376 3.2469 2.7260 2.9470 5.4691 6.3067 2.6827 3.8227 6.7022 4.5010 2.6257 3.7127 4.4248 3.0373 3.4160 3.4390 3.3262 3.4933 4.5793 3.6526 3.3706 3.9165 3.9152 3.9748 6.9468 8.0457 6.4655 6.3967 6.3718 6.2686 4.2074 6.7256 3.9932 3.2903 3.3026 6.1181 2.6002 1.8931 1.8649 6.0256 2.4041 3.0921 1.7980 7.5247 2.4750 1.8996 1.8623 1.8549 2.8989 3.6463 1.3446 2.1921 2.1691 3.0940 1.4404 2.1524 4.0061 4.9599 3.4712 1.2843 2.0373 2.5495 1.4659 1.2745 2.4228 1.7060 2.0543 1.3576 1.4695 1.4055 1.4323 1.5571 1.3478 1.4006 2.1079 1.4014 1.4178 1.5626 1.3888 1.6888 1.7464 1.6366 2.6707 1.4122 1.3277 1.3655 1.3761 1.3704 1.4378 1.8028 3.8222 1.6625 3.5814 4.4110 5.2909 1.4042 1.5202 1.3281 1.3347 1.4650 1.3139 1.7986 2.0346 2.3841 2.5091 2.4591 1.6119 2.0632 2.0377 1.3719 1.5264 1.4692 1.6498 1.5153 1.4986 2.6524 2.8380 3.0327 2.4205 2.7634 1.6336 2.3138 1.2494 2.7198 1.2709 1.0780 1.0705 1.0661 1.0634 2.4304 1.1194 1.1158 2.1503 1.5108 2.4827 1.1529 2.8176 1.7512 1.5051 2.9455 2.8904 1.2783 2.9640 2.3048 2.4878 1.9771 2.3723 1.1941 3.0033 2.6669 1.3474 1.3652 1.4204 3.3187 1.4724 1.6581 1.3758 1.6659 4.9894 1.4475 1.5245 2.0368 1.9846 1.3639 1.3810 2.0470 1.4810 5.7665 1.4727 1.5132 3.8057 1.6157 6.8654 1.5070 1.3378 5.6543 1.3353 2.0474 2.3305 1.0945 1.1189 1.0551 1.0801 1.0590 1.0794 1.0594 1.0875 1.3839 1.0670 1.6543 1.3312 1.0741 1.0689 1.0579 1.0714 1.1001 1.0793 1.5854 1.3806 1.1283 2.3483 2.3759 1.1619 1.0791 1.0647 2.5963 2.9730 2.3381 2.2644 2.2483 3.2263 4.4610 6.1267 6.2368 6.3328 6.2462 6.3197 6.2314 6.9204 6.8889 7.7552 12.7457 1.0666 1.0665 1.0670 1.0810 1.0368 1.0400 1.0373 1.0376 1.0379 1.0380 1.0378 1.0377 1.0789 1.0376 1.0826 1.1014 1.0974 1.1013 1.0908 1.1037 1.0915 1.1050 1.1044 1.1043 1.1045 1.1016 1.1034 1.1042 1.1045 1.1045 1.1045 1.1046 1.1040 1.1035 1.1040 1.1046 1.1036 1.1033 1.0909 1.0873 1.0863 1.0871 1.0869 1.0902 1.0891 1.0920 1.0938 1.0918 1.0927 1.0958 1.0957 1.0968 1.0967 1.1004 1.1008 1.0965 1.0984 1.0932 1.0938 1.0959 1.0935
temp: 298.150 k
press: 1.00000 atm
elementType: 46 15 6 6 6 6 1 6 1 6 1 1 1 6 6 6 6 1 6 1 6 1 1 1 6 6 6 6 1 6 1 6 1 1 1 6 6 6 6 6 1 1 1 1 1 7 6 8 8 6 6 6 6 1 6 1 6 1 1 1 6 1 1 1 6 6 6 6 6 6 1 1 1 1 1 1 1 1 1 6 6 6 6 5 5 8 8 8 8 6 1 1 1 6 1 1 1 6 1 1 1 6 1 1 1 6 1 1 1 6 1 1 1 6 1 1 1 6 1 1 1
symmnumber: 1
zpe: 2684706.7 jmol-1
zpe.correction: 1.022551 hartree
zpe.thermalcorrener: 1.081325 hartree
zpe.thermalcorrenthalpy: 1.082269 hartree
zpe.thermalcorrgfe: 0.928855 hartree
zpe.sumelectzpe: -2923.438520 hartree
zpe.sumelectthermal: -2923.379745 hartree
zpe.sumelectthermalent: -2923.378801 hartree
zpe.sumelectthermalfe: -2923.532215 hartree
dipole: -2.1838 -1.0929 0.8193
dipole: 2.5757
quadrupole: -334.9252 -309.6213 -325.7550
quadrupole: -12.5078 13.3790 17.7632
quadrupole: -11.4913 13.8125 -2.3212 -12.5078 13.3790 17.7632
hfenergy: -2924.4610704 hartree
pointgroup: C01 [X(C49H61B2N1O6P1Pd1)]
dipole: -0.743462 -0.6508734 0.224856 debye
polarizability: 861.8061057|-23.2599936|868.9738924|7.6784453|11.0539058|803.8573866 unknown
InChI: InChI=1/49C.2B.N.6O.P.Pd.61H
charge 1 multiplicity 1
121 atoms
Pd -0.57101875 0.36044653 -0.2766664
P  0.76142587 -1.10507819 1.03795237
C  2.14036785 -0.2759399 1.89758108
C  3.33345409 -0.94298301 2.20029211
C  1.94756536 1.03333239 2.35316223
C  4.31157928 -0.30820904 2.96295672
H  3.49580762 -1.96320627 1.84577728
C  2.92391996 1.66235462 3.12248166
H  1.02158993 1.56032016 2.11405204
C  4.10589092 0.98942478 3.43107126
H  5.24258198 -0.83162891 3.19130802
H  2.76079867 2.68303281 3.47600884
H  4.87597951 1.4829625 4.02827957
C  1.54636991 -2.54726574 0.22502043
C  2.36702921 -2.32350523 -0.88843149
C  1.36962741 -3.85724343 0.68645042
C  2.97731534 -3.38932602 -1.54392449
H  2.55322942 -1.30457568 -1.22615844
C  1.98099976 -4.9231687 0.02659459
H  0.75174035 -4.05459631 1.56315849
C  2.77815584 -4.69467195 -1.09335119
H  3.61291763 -3.19907024 -2.41189902
H  1.83094989 -5.94028884 0.39567784
H  3.25136975 -5.53216311 -1.6109585
C  -0.18766582 -1.87122891 2.39888816
C  -1.30773606 -2.64789407 2.06916325
C  0.18304766 -1.72843036 3.74026617
C  -2.03042047 -3.29055294 3.06978632
H  -1.62154226 -2.76191635 1.0291104
C  -0.55838819 -2.35940026 4.74026981
H  1.05309727 -1.12687374 4.0101283
C  -1.66028269 -3.14571827 4.40784453
H  -2.89683085 -3.89909782 2.80020047
H  -0.26496924 -2.23906264 5.78564779
H  -2.23449241 -3.64327944 5.19282682
C  0.52400458 2.98399294 -2.57289927
C  0.63538507 0.59448121 -2.02389321
C  -0.75424982 0.55889172 -2.35350933
C  -1.48147037 1.65361318 -1.87938182
C  -0.87365479 3.04639692 -1.92986335
H  1.09305507 3.87326955 -2.27738006
H  1.26705794 -0.26758915 -2.23504732
H  -1.23322234 -0.3433225 -2.73404567
H  -2.57367003 1.59722251 -1.89906371
H  -1.51508918 3.56948196 -2.65935093
N  1.27400565 1.83836292 -2.04413235
C  2.58656108 2.01630356 -1.70049159
O  3.12698905 0.86145201 -1.26438749
O  3.17421194 3.06741592 -1.77503451
C  4.43480614 0.83643043 -0.81012102
C  4.88108418 1.71853404 0.16823947
C  5.25991723 -0.15998207 -1.32247763
C  6.18612704 1.5929335 0.63823565
H  4.21294569 2.48151614 0.5655032
C  6.56020762 -0.2815187 -0.83523589
H  4.88008502 -0.82945307 -2.09575638
C  7.02684926 0.5955079 0.14381516
H  6.54260846 2.27693337 1.41162519
H  7.21094033 -1.06556757 -1.22877054
H  8.04644292 0.50057932 0.52354476
C  0.47620433 2.93161608 -4.09439062
H  -0.0927832 2.06421216 -4.46088818
H  -0.00038404 3.84228692 -4.48387295
H  1.49503143 2.87659989 -4.50352278
C  -2.05946593 5.70678855 0.66199795
C  -1.92388253 4.77197698 -0.50035473
C  -0.91921297 3.89759297 -0.67263184
C  0.20453934 3.80913609 0.32748328
C  0.3121016 5.05836155 1.19462252
C  -1.0382156 5.45947301 1.76941816
H  -2.69919594 4.84024196 -1.27300767
H  -1.96672643 6.74056101 0.27918901
H  0.05814978 2.91703578 0.96122107
H  1.16389447 3.64384312 -0.18348005
H  1.04325377 4.88933257 2.0009348
H  0.70823466 5.88404428 0.57768033
H  -1.39644699 4.65865196 2.43507182
H  -0.94113139 6.35825318 2.39777495
H  -3.08644196 5.64668269 1.06256009
C  -3.29416471 -2.65948245 -3.04598264
C  -2.60316788 -3.59219695 -1.99417273
C  -4.57931142 1.15062388 1.41468246
C  -3.16071844 0.90082292 2.02253098
B  -3.5117724 -0.45372611 0.19279608
B  -3.23880993 -1.63787778 -1.01359007
O  -2.51378317 0.14705868 0.94434948
O  -4.73816942 0.01960817 0.52118288
O  -2.94824865 -2.94437936 -0.7443431
O  -3.31412566 -1.38423728 -2.35525443
C  -3.18481351 0.00119599 3.24460822
H  -3.62254622 0.52969676 4.10254806
H  -3.76195895 -0.91572403 3.06445205
H  -2.15847164 -0.28839634 3.50420073
C  -2.35757659 2.14795001 2.2916834
H  -2.86916752 2.77780171 3.03367802
H  -1.3755217 1.87371911 2.70294183
H  -2.20927472 2.73267549 1.37702833
C  -4.65254434 2.40567108 0.55711615
H  -5.59343322 2.39566574 -0.01070898
H  -4.63267415 3.31278052 1.17694035
H  -3.81872112 2.46172358 -0.15569071
C  -5.70951669 1.13251895 2.42377022
H  -5.77658652 0.16768395 2.94159396
H  -5.57091169 1.92663474 3.17177909
H  -6.66335433 1.31364256 1.90813716
C  -4.7462496 -3.03037729 -3.3135227
H  -4.8229727 -3.96105936 -3.89257876
H  -5.30754023 -3.15303365 -2.37575922
H  -5.21878682 -2.22381526 -3.89208878
C  -3.12204825 -5.01552284 -1.96536036
H  -4.19473956 -5.05244461 -1.73754893
H  -2.94964918 -5.5084377 -2.93330901
H  -2.58659471 -5.5864587 -1.19316087
C  -1.08446501 -3.58257044 -2.08854058
H  -0.73376412 -4.0860218 -2.999716
H  -0.68470458 -2.55843344 -2.074279
H  -0.66339328 -4.11021501 -1.22197417
C  -2.5405779 -2.50330685 -4.35155897
H  -3.0792523 -1.80461976 -5.0076598
H  -1.52341681 -2.11910299 -4.20144352
H  -2.46889624 -3.47045904 -4.87032808
