program: Gaussian 16
title: Title
version: ES64L-G16RevC.01
method: RPBE1PBE
basis: def2SVP
operation: Freq
keyword: #N
keyword: Geom=AllCheck
keyword: Guess=TCheck
keyword: SCRF=Check
keyword: GenChk
keyword: RPBE1PBE/def2SVP
keyword: Freq
converged: YES YES NO YES
title: Mulliken charges:
elementType: Pd P C C C C H C H C H H H C C C C H C H C H H H C C C C H C H C H H H C C C C C H H H H H N C O O C C C C H C H C H H H C H H H C C C C C C H H H H H H H H H C C C C B B O O O O C H H H C H H H C H H H C H H H C H H H C H H H C H H H C H H H
charge: -0.307655 0.317896 -0.152556 -0.020791 -0.059360 -0.017520 0.065666 -0.012736 0.087896 -0.016074 0.050857 0.049692 0.052748 -0.171136 -0.029022 -0.014174 -0.014441 0.068519 -0.021187 0.058668 -0.017218 0.045857 0.043456 0.047700 -0.109765 -0.001682 -0.031025 -0.040176 0.090002 -0.028405 0.032300 -0.012125 0.043713 0.042140 0.044352 -0.045046 0.081099 0.044834 -0.160929 0.055338 0.069297 0.138230 0.147087 0.117106 0.066819 -0.304449 0.433658 -0.336030 -0.283548 0.123460 -0.000208 0.002562 -0.037651 0.037345 -0.034215 0.027974 -0.015932 0.048012 0.044038 0.044896 0.018539 0.066258 0.058057 0.065174 0.023014 -0.121011 -0.156522 0.047259 -0.068265 -0.066998 0.042332 0.055456 0.044043 0.033403 0.028698 0.048024 0.033548 0.034482 0.037592 -0.161116 -0.146680 -0.156067 -0.158518 0.290528 0.219571 -0.263275 -0.258631 -0.259439 -0.261935 0.035990 0.053354 0.058518 0.054426 0.033032 0.051556 0.063523 0.059649 0.039830 0.045464 0.053948 0.055172 0.029269 0.056543 0.051902 0.060909 0.037282 0.056870 0.057056 0.060330 0.017081 0.054103 0.058886 0.053206 0.046992 0.054409 0.058047 0.047927 0.009901 0.053400 0.059262 0.076481
chargesum: 1.00000
title: Mulliken charges with hydrogens summed into heavy atoms:
elementType: Pd P C C C C C C C C C C C C C C C C C C C C C C C N C O O C C C C C C C C C C C C C C C C C B B O O O O C C C C C C C C
charge: -0.307655 0.317896 -0.152556 0.044875 0.028536 0.033336 0.036957 0.036674 -0.171136 0.039497 0.044494 0.031416 0.022269 0.030482 -0.109765 0.088319 0.001275 0.003536 0.013735 0.032227 0.024251 0.219329 0.191921 -0.043824 0.122157 -0.304449 0.433658 -0.336030 -0.283548 0.123460 0.037137 0.030536 0.010361 0.009823 0.028964 0.208028 0.116062 -0.078679 -0.156522 0.124705 0.008457 0.001033 -0.161116 -0.146680 -0.156067 -0.158518 0.290528 0.219571 -0.263275 -0.258631 -0.259439 -0.261935 0.202288 0.207760 0.194415 0.198624 0.211538 0.183275 0.207376 0.199044
chargesum: 0.99999
1716.lowfreq: -6.6640 -3.6355 -1.1849 -0.0012 -0.0011 -0.0009 11.3470 16.4994 21.9267
redmass: 5.0240 4.5957 4.7687 4.9368 3.5716 4.2269 5.0462 3.9288 4.0901 4.5784 5.3491 4.7209 5.4903 4.0396 4.2806 4.9976 5.5033 5.7744 5.6405 5.5305 5.3336 4.2206 4.9725 4.0856 4.6745 4.0660 4.1207 4.6085 4.2080 3.6533 4.2898 4.6710 4.7932 4.8257 3.7708 4.6786 5.8887 5.6696 5.6638 4.5184 4.8765 3.1629 4.4205 1.2219 1.2179 1.2575 3.3083 3.0831 4.9875 1.2257 1.5069 2.8289 4.7757 2.8018 2.2541 2.1469 1.6820 2.1526 2.3693 1.1359 1.2730 1.2884 1.2379 2.2197 2.2571 2.6752 2.5321 2.2215 2.1328 4.0497 3.0752 2.5682 2.5789 3.0267 3.4804 5.6087 2.9198 5.0803 3.3031 3.0844 2.8604 6.6975 3.6958 4.2758 2.5772 2.7042 6.5674 3.6970 4.4886 3.6751 3.3098 3.3263 3.3727 4.3502 3.9613 4.9517 6.0040 3.9113 4.0089 4.1373 6.9687 6.3709 6.3994 6.3654 6.3817 4.1511 3.6525 3.2400 3.2491 2.7090 6.1453 5.0744 1.8765 1.7868 1.8360 2.0856 4.5689 1.7859 8.2899 1.9860 1.7690 1.9764 9.0545 7.3925 2.0710 1.7334 1.8697 2.4777 3.4854 3.5571 1.7219 1.2495 1.3159 1.9941 1.4827 2.4298 2.9983 2.4761 1.2477 2.0581 1.8638 1.3666 1.4075 1.3985 1.4648 1.4568 1.5065 1.9876 1.3536 1.5628 1.3774 1.7202 1.5103 1.5117 1.7788 1.7628 2.4060 1.3036 1.3065 1.2956 1.3707 1.3761 1.3732 2.3619 1.9714 2.1723 3.8671 2.6731 1.8906 4.3896 1.5444 1.3323 1.3420 1.3309 1.3273 2.2206 1.9825 2.5389 2.4958 2.6526 1.6456 1.7136 1.9411 1.3648 1.4101 1.5668 1.5125 1.5877 2.0552 2.7830 3.0002 2.7083 2.6020 2.7481 1.7633 2.7145 1.2818 1.7035 2.6652 1.0792 1.2055 1.1177 1.0749 1.0692 1.1530 1.9022 3.1408 2.8393 1.6612 1.5233 1.1979 1.1506 1.5639 5.6072 2.9227 2.8963 1.3254 2.6955 1.7659 2.4987 2.4872 1.6744 2.8355 2.7960 1.5495 1.3875 1.3385 1.3883 1.4796 1.4059 3.4218 2.0685 1.4310 4.4206 1.4900 1.6065 1.7356 1.6885 1.3646 1.3696 5.7157 3.0102 1.5668 1.5993 1.5666 1.5250 1.4670 4.7920 5.1320 1.2903 1.2904 8.2248 1.7539 2.1609 1.1433 1.1086 1.0613 1.0621 1.0594 1.0595 1.0556 1.0546 1.0768 1.0810 1.0754 1.0994 1.0654 1.0498 1.0516 1.1190 1.0707 1.0915 2.2838 1.1500 2.0623 1.1307 2.2510 1.0652 1.0671 2.5555 3.4693 2.2522 2.2492 2.2193 2.7431 4.8345 5.9625 6.2043 6.1882 6.2422 6.1564 6.2146 6.8460 6.9419 7.6376 12.8076 1.0725 1.0830 1.0655 1.0637 1.0370 1.0369 1.0369 1.0379 1.0374 1.0371 1.0376 1.0656 1.0380 1.0378 1.1007 1.1025 1.0912 1.1021 1.0970 1.1043 1.1047 1.1044 1.1045 1.1043 1.1026 1.1037 1.1042 1.1040 1.0972 1.1037 1.1043 1.1048 1.1045 1.1041 1.1040 1.0903 1.1043 1.1034 1.0893 1.0883 1.0900 1.0871 1.0871 1.0893 1.0898 1.0938 1.0916 1.0944 1.0937 1.0889 1.0978 1.0985 1.0960 1.0996 1.1011 1.0993 1.0945 1.0946 1.0951 1.0958 1.0964
temp: 298.150 k
press: 1.00000 atm
elementType: 46 15 6 6 6 6 1 6 1 6 1 1 1 6 6 6 6 1 6 1 6 1 1 1 6 6 6 6 1 6 1 6 1 1 1 6 6 6 6 6 1 1 1 1 1 7 6 8 8 6 6 6 6 1 6 1 6 1 1 1 6 1 1 1 6 6 6 6 6 6 1 1 1 1 1 1 1 1 1 6 6 6 6 5 5 8 8 8 8 6 1 1 1 6 1 1 1 6 1 1 1 6 1 1 1 6 1 1 1 6 1 1 1 6 1 1 1 6 1 1 1
symmnumber: 1
zpe: 2681327.7 jmol-1
zpe.correction: 1.021264 hartree
zpe.thermalcorrener: 1.080316 hartree
zpe.thermalcorrenthalpy: 1.081260 hartree
zpe.thermalcorrgfe: 0.926342 hartree
zpe.sumelectzpe: -2923.437798 hartree
zpe.sumelectthermal: -2923.378746 hartree
zpe.sumelectthermalent: -2923.377802 hartree
zpe.sumelectthermalfe: -2923.532720 hartree
dipole: 2.2517 3.0624 -2.7516
dipole: 4.6926
quadrupole: -289.3137 -347.6436 -314.6776
quadrupole: -13.6926 -6.3578 18.5427
quadrupole: 27.8979 -30.4320 2.5341 -13.6926 -6.3578 18.5427
hfenergy: -2924.4590622 hartree
pointgroup: C01 [X(C49H61B2N1O6P1Pd1)]
dipole: 0.9060011 1.1554789 -1.1191307 debye
polarizability: 918.6215325|2.6538471|802.4760635|-35.6460005|14.7492838|847.8565176 unknown
InChI: InChI=1/49C.2B.N.6O.P.Pd.61H
charge 1 multiplicity 1
121 atoms
Pd 0.41466992 -0.363444 -0.72638838
P  -0.9331858 1.55148409 -0.29837137
C  -1.82941054 1.50460663 1.28473088
C  -2.81598609 2.4388471 1.63976434
C  -1.48461799 0.49634894 2.19502695
C  -3.42049686 2.37709083 2.89281262
H  -3.12727981 3.2151741 0.93850036
C  -2.08835419 0.44246715 3.45062386
H  -0.72475571 -0.24077159 1.9292658
C  -3.05140198 1.3862863 3.80367147
H  -4.18684032 3.10851312 3.1577804
H  -1.80435943 -0.34536468 4.15170002
H  -3.52597728 1.34393783 4.7865621
C  -2.181472 1.80031791 -1.62040578
C  -1.70693334 2.05155326 -2.91752893
C  -3.55816905 1.68457845 -1.40820024
C  -2.59768844 2.19071816 -3.97775601
H  -0.63375247 2.13791492 -3.105264
C  -4.44772578 1.8295438 -2.47333164
H  -3.95007313 1.47082657 -0.41440761
C  -3.97234119 2.08188493 -3.75789308
H  -2.21460757 2.38508171 -4.98197476
H  -5.52051124 1.73692859 -2.28967153
H  -4.6709525 2.19194392 -4.59032025
C  -0.01385937 3.13141484 -0.40088319
C  1.09801033 3.18282676 -1.24991418
C  -0.41860664 4.28714812 0.27500528
C  1.78194864 4.38231466 -1.43429484
H  1.4585162 2.27725465 -1.74388553
C  0.27812927 5.48108077 0.098815
H  -1.26470017 4.26558323 0.96183493
C  1.37580273 5.53312891 -0.7600979
H  2.64869644 4.41269961 -2.09842364
H  -0.04034654 6.37505965 0.63967685
H  1.91949439 6.4706285 -0.89803144
C  -1.0707849 -3.67042971 -1.17576105
C  -1.36800665 -1.34202249 -1.8489381
C  -0.13572758 -1.43754192 -2.51823938
C  0.86054794 -2.22285749 -1.89838522
C  0.44668662 -3.45187415 -1.0987971
H  -1.38222633 -4.26746838 -0.3119518
H  -2.12564643 -0.6180656 -2.15038492
H  0.08331403 -0.76178405 -3.34723226
H  1.8449913 -2.25336815 -2.36811757
H  0.89231801 -4.29840671 -1.65188402
N  -1.78886758 -2.39383723 -1.0598122
C  -2.97019161 -2.36939358 -0.3510464
O  -3.54672 -1.16105684 -0.43731522
O  -3.41532471 -3.3071399 0.25842081
C  -4.80655325 -0.98537291 0.11635063
C  -5.91083655 -1.02410358 -0.72769851
C  -4.92693038 -0.69549206 1.46939756
C  -7.17232504 -0.76087563 -0.19548725
H  -5.77205838 -1.24651644 -1.78720732
C  -6.1932494 -0.43379403 1.98980695
H  -4.03604495 -0.6613385 2.0970005
C  -7.31519643 -0.46538498 1.16095382
H  -8.04792962 -0.78381864 -0.84799315
H  -6.29872443 -0.19777522 3.05111859
H  -8.30484298 -0.25568396 1.57253432
C  -1.49973652 -4.38673617 -2.45008291
H  -1.03513372 -5.38174438 -2.4936063
H  -2.59111679 -4.51814575 -2.46359751
H  -1.20374975 -3.83060644 -3.35233177
C  0.87339157 -3.35998206 2.79118924
C  0.33166924 -3.23232186 1.4014537
C  1.03300604 -3.52344193 0.2958472
C  2.45431421 -4.00815562 0.35834972
C  3.10326388 -3.76708009 1.71101983
C  2.16796813 -4.16401178 2.84542547
H  -0.70090929 -2.87884534 1.31362467
H  1.03671498 -2.34234955 3.18550672
H  2.4614956 -5.08573609 0.10340916
H  3.03989201 -3.51248983 -0.43068122
H  4.05574186 -4.31645232 1.77800015
H  3.343081 -2.69645645 1.79025834
H  1.93496224 -5.24051796 2.76193167
H  2.65797343 -4.02593153 3.82260704
H  0.10755279 -3.81522644 3.44193255
C  4.73383955 -0.83396855 -1.28632377
C  4.31887902 0.42604428 -2.13563327
C  2.45328531 0.45284606 2.98127054
C  2.59921661 1.87366134 2.32284596
B  1.7443884 0.38696961 0.81348028
B  2.55066846 -0.29214652 -0.88861014
O  2.36474975 1.59542037 0.92092762
O  1.6584454 -0.2691749 2.00468569
O  2.87430237 0.43321569 -1.99990825
O  3.597984 -1.01069046 -0.39915115
C  3.97277902 2.50194015 2.45762472
H  3.98393905 3.4685322 1.9338492
H  4.21303545 2.68394553 3.51515349
H  4.75741026 1.86812379 2.02581146
C  1.53079582 2.85984329 2.76769355
H  1.67832851 3.15345199 3.8161481
H  1.59053634 3.76062954 2.14234423
H  0.52064291 2.44083668 2.66070054
C  1.71926411 0.44666275 4.30798679
H  0.70378557 0.85041272 4.21664948
H  1.64703274 -0.58369435 4.68493849
H  2.26865397 1.04113142 5.05246328
C  3.77539555 -0.28822118 3.11046986
H  4.28589675 -0.364011 2.14109943
H  4.43990805 0.20834261 3.83071953
H  3.58147744 -1.30685962 3.47318562
C  5.97293493 -0.6431722 -0.43366791
H  5.86256829 0.19692483 0.26303587
H  6.15778698 -1.5546938 0.15248147
H  6.85325734 -0.45922029 -1.06642736
C  4.81660983 1.74040326 -1.55247083
H  4.37459187 2.57018315 -2.12193476
H  4.51142883 1.85277901 -0.50367348
H  5.90978844 1.82162274 -1.62393494
C  4.66255676 0.33831983 -3.60906366
H  4.31583244 1.24802189 -4.11980478
H  5.75094346 0.26483762 -3.74810466
H  4.18763758 -0.52650889 -4.08915704
C  4.86166637 -2.1057899 -2.11095805
H  3.96841664 -2.29150513 -2.72363916
H  5.72990787 -2.054854 -2.7820879
H  5.00230786 -2.96236561 -1.4370641
