program: Gaussian 16
title: Title
version: ES64L-G16RevC.01
method: RPBE1PBE
basis: def2SVP
operation: Freq
keyword: #N
keyword: Geom=AllCheck
keyword: Guess=TCheck
keyword: SCRF=Check
keyword: GenChk
keyword: RPBE1PBE/def2SVP
keyword: Freq
converged: YES YES NO YES
title: Mulliken charges:
elementType: Pd P C C C C H C H C H H H C C C C H C H C H H H C C C C H C H C H H H C C C C C H H H H H N C O O C C C C H C H C H H H C H H H C C C C C C H H H H H H H H H C C C C B B O O O O C H H H C H H H C H H H C H H H C H H H C H H H C H H H C H H H
charge: -0.294864 0.361321 -0.178934 -0.008389 0.003908 -0.023671 0.058291 -0.033519 0.090390 -0.006736 0.049984 0.046304 0.052057 -0.171257 -0.017367 -0.024919 -0.019672 0.053302 -0.011264 0.056951 -0.010586 0.046986 0.046248 0.050058 -0.155985 -0.030260 -0.017131 -0.026874 0.094927 -0.023097 0.048518 -0.005689 0.053528 0.047391 0.048541 0.006387 0.145635 -0.156009 0.005771 -0.103085 0.069273 0.120025 0.113914 0.098361 0.065198 -0.352602 0.420322 -0.333602 -0.293309 0.173520 -0.030266 -0.037119 -0.040193 0.039364 -0.034634 0.052892 -0.020094 0.047814 0.042017 0.043681 0.018356 0.060821 0.056581 0.057939 0.034362 -0.158637 -0.155948 0.037879 -0.087033 -0.062761 0.112476 0.072122 0.063334 0.064643 0.044501 0.071557 0.044141 0.053325 0.060884 -0.141973 -0.164025 -0.164673 -0.169978 0.302525 0.239424 -0.268608 -0.259910 -0.270222 -0.275312 0.047377 0.054699 0.055445 0.045319 0.057884 0.048251 0.054321 0.045664 0.055525 0.040599 0.052965 0.055117 0.042184 0.036973 0.055935 0.058315 0.039981 0.045807 0.051698 0.056692 0.033384 0.071873 0.054821 0.051765 0.043919 0.044586 0.057424 0.047115 0.022720 0.053658 0.055680 0.054768
chargesum: 1.00000
title: Mulliken charges with hydrogens summed into heavy atoms:
elementType: Pd P C C C C C C C C C C C C C C C C C C C C C C C N C O O C C C C C C C C C C C C C C C C C B B O O O O C C C C C C C C
charge: -0.294864 0.361321 -0.178934 0.049902 0.094298 0.026313 0.012784 0.045321 -0.171257 0.035934 0.032031 0.027314 0.034984 0.039472 -0.155985 0.064667 0.031387 0.026654 0.024294 0.042851 0.075660 0.265659 -0.042094 0.104132 -0.037887 -0.352602 0.420322 -0.333602 -0.293309 0.173520 0.009098 0.015772 0.007621 0.007383 0.023586 0.193697 0.167368 -0.046161 -0.155948 0.165855 0.029025 0.034706 -0.141973 -0.164025 -0.164673 -0.169978 0.302525 0.239424 -0.268608 -0.259910 -0.270222 -0.275312 0.202841 0.206120 0.204206 0.193407 0.194179 0.211843 0.193045 0.186826
chargesum: 0.99999
1716.lowfreq: -0.0009 -0.0006 0.0005 3.8579 5.6537 7.8548 14.8623 20.7576 26.7793
redmass: 5.5001 4.9532 5.0562 4.2380 4.5219 4.0843 4.0851 4.1121 4.7055 4.5895 4.8235 4.5931 5.7008 5.0428 6.4209 4.9585 5.0924 4.8164 5.0784 4.3196 4.8358 5.4350 3.8016 4.2018 3.5294 5.5212 4.5249 4.1745 3.9388 4.6086 3.5009 4.5814 5.6375 3.0104 3.9101 5.7439 4.9349 4.4792 4.7169 2.8607 3.7071 2.1534 2.9961 1.1789 1.1554 1.2713 2.1418 4.6247 4.1100 1.2429 2.3148 4.6581 3.8933 1.8369 1.5597 1.5467 2.5084 3.0751 1.7328 1.4407 1.3473 1.9472 1.2558 2.7707 2.3516 3.1216 2.3133 2.4485 1.9688 5.7784 2.3121 2.8517 2.7115 3.8510 2.9654 2.9559 3.6383 5.6467 3.0910 3.7839 2.6374 4.7810 5.0250 3.2759 2.5502 5.8523 3.1398 3.2987 3.8860 3.9571 3.3510 4.1698 4.9439 3.8544 4.1872 4.2420 3.9245 4.0650 7.7406 5.5402 6.3751 6.1470 6.2964 6.2709 3.4658 3.4764 3.2533 3.5415 4.0068 6.2227 4.5097 1.9059 1.8201 1.8634 2.0200 5.7343 3.5195 1.6327 2.8139 1.9064 2.2605 2.6871 3.4836 7.4511 1.6137 1.4297 2.4649 2.9979 3.5339 1.2540 2.8426 2.8789 2.5611 1.5407 1.2475 2.5062 2.4765 1.2669 2.5102 2.0658 1.6371 2.1614 1.3998 1.4054 1.4565 1.4374 1.6036 1.3588 1.3469 1.9580 1.3357 1.7267 1.7785 1.8364 1.3441 1.7533 2.1401 1.3255 1.2798 1.4517 1.3822 1.3662 1.6064 5.1360 3.9184 1.6976 3.1138 2.0196 3.5647 1.3814 1.3283 1.3332 1.3398 1.3280 1.8260 2.0203 2.2079 2.3969 2.6001 2.5242 1.8783 2.0040 1.3877 1.4815 1.4833 1.5875 1.5807 1.5789 2.7041 2.9577 2.4423 1.8227 2.4640 2.7218 2.6413 2.5129 1.3737 1.0775 1.4297 1.0663 1.0629 1.1331 2.2014 1.1179 1.5397 1.1174 1.5987 1.9922 1.3151 2.9403 1.1369 1.5946 6.0744 2.9063 2.9377 1.8074 1.3250 2.8653 2.5180 2.4642 1.9270 1.3870 2.6110 2.7342 1.3405 1.3854 1.3609 1.3950 1.3755 1.7582 1.3786 6.9538 1.7505 1.3894 3.5771 1.7117 1.6042 1.4094 1.4283 1.6826 4.0019 1.4741 1.3678 1.6522 4.8852 4.5783 1.6422 1.5132 5.4980 1.3057 1.5133 3.6369 3.4795 1.6694 1.5715 1.0579 1.0535 1.0820 1.0579 1.0606 1.0811 1.0661 1.1974 1.0634 1.0633 1.0669 1.1228 1.2045 1.0530 1.0767 1.0748 1.4782 1.3957 1.7286 1.0938 1.4686 1.5372 2.3645 1.0824 1.0604 2.5818 2.2953 2.2471 2.2121 2.7551 6.3706 6.1017 6.1133 6.2491 6.2299 6.2144 6.2269 6.9324 6.8084 6.9671 12.7121 1.0803 1.0722 1.0663 1.0369 1.0371 1.0373 1.0379 1.0648 1.0381 1.0373 1.0381 1.0380 1.0387 1.0651 1.0856 1.1004 1.1022 1.0875 1.0911 1.1026 1.1049 1.1050 1.1042 1.1043 1.1042 1.1037 1.1047 1.1042 1.1038 1.1044 1.1042 1.1045 1.1042 1.1040 1.0929 1.1031 1.1043 1.1025 1.0882 1.1020 1.0882 1.0869 1.0866 1.0880 1.0899 1.0894 1.0912 1.0907 1.0925 1.0936 1.0930 1.0948 1.0961 1.0965 1.0971 1.0993 1.1011 1.0997 1.0984 1.0976 1.0939
temp: 298.150 k
press: 1.00000 atm
elementType: 46 15 6 6 6 6 1 6 1 6 1 1 1 6 6 6 6 1 6 1 6 1 1 1 6 6 6 6 1 6 1 6 1 1 1 6 6 6 6 6 1 1 1 1 1 7 6 8 8 6 6 6 6 1 6 1 6 1 1 1 6 1 1 1 6 6 6 6 6 6 1 1 1 1 1 1 1 1 1 6 6 6 6 5 5 8 8 8 8 6 1 1 1 6 1 1 1 6 1 1 1 6 1 1 1 6 1 1 1 6 1 1 1 6 1 1 1 6 1 1 1
symmnumber: 1
zpe: 2687009.1 jmol-1
zpe.correction: 1.023428 hartree
zpe.thermalcorrener: 1.081832 hartree
zpe.thermalcorrenthalpy: 1.082776 hartree
zpe.thermalcorrgfe: 0.930072 hartree
zpe.sumelectzpe: -2923.473188 hartree
zpe.sumelectthermal: -2923.414784 hartree
zpe.sumelectthermalent: -2923.413839 hartree
zpe.sumelectthermalfe: -2923.566544 hartree
dipole: 4.3214 3.6453 -2.1819
dipole: 6.0600
quadrupole: -296.1406 -317.7732 -333.6557
quadrupole: -10.3648 3.5004 9.7813
quadrupole: 19.7159 -1.9167 -17.7992 -10.3648 3.5004 9.7813
hfenergy: -2924.4966154 hartree
pointgroup: C01 [X(C49H61B2N1O6P1Pd1)]
dipole: 1.7246568 1.6296306 -0.2329155 debye
polarizability: 919.4635067|7.9043367|819.6160378|-45.1899568|28.6799018|798.8165994 unknown
InChI: InChI=1/49C.2B.N.6O.P.Pd.61H
charge 1 multiplicity 1
121 atoms
Pd 0.1359959 -0.38797594 0.28635966
P  -0.56734077 1.7345597 -0.11620326
C  -1.81531748 2.33034636 1.06740475
C  -2.51546253 3.52150176 0.81891366
C  -2.15513345 1.55067226 2.17803055
C  -3.51581652 3.93871241 1.69226023
H  -2.29996638 4.11557087 -0.07222941
C  -3.16135734 1.97016058 3.04723308
H  -1.63145356 0.6115252 2.35922568
C  -3.83750557 3.16546575 2.80925643
H  -4.05427249 4.86771186 1.49314593
H  -3.42149764 1.35295769 3.90984194
H  -4.62699012 3.49209792 3.49001611
C  -1.48068033 1.81026741 -1.70924127
C  -0.81483922 2.03284707 -2.92060179
C  -2.86137363 1.56215934 -1.72156926
C  -1.51946348 2.00470716 -4.12307883
H  0.25717965 2.23768442 -2.93509774
C  -3.560103 1.53422817 -2.92605714
H  -3.39821053 1.38412833 -0.78836366
C  -2.89103645 1.75378296 -4.12987478
H  -0.98882461 2.18365927 -5.06078962
H  -4.63456793 1.3379901 -2.91906385
H  -3.43962025 1.73190631 -5.07411891
C  0.74370168 2.98346673 -0.31367949
C  1.88281822 2.59202934 -1.03359716
C  0.6438951 4.29165432 0.17193617
C  2.88374151 3.52037774 -1.30822359
H  1.99216922 1.55515551 -1.36776679
C  1.66200179 5.20839525 -0.08819664
H  -0.21780677 4.59967453 0.76550348
C  2.77349979 4.82966427 -0.84032009
H  3.76575939 3.21598004 -1.87577337
H  1.58267034 6.22575578 0.30086989
H  3.56555256 5.55257247 -1.04761066
C  -1.14155543 -3.85689076 -0.76108755
C  -1.46116313 -1.52468017 -1.48010661
C  -0.18353654 -1.44222396 -1.93522433
C  0.76696795 -2.59240345 -1.83490924
C  0.34124836 -3.4645963 -0.63595787
H  -1.44327693 -4.35904605 0.168506
H  -2.17187781 -0.71687845 -1.63623625
H  0.09001121 -0.56024001 -2.51831223
H  0.64996879 -3.214861 -2.7461113
H  0.90230597 -4.41062514 -0.69172074
N  -1.97643854 -2.65408693 -0.86519678
C  -3.23684029 -2.68502085 -0.32079814
O  -3.84236112 -1.48734282 -0.45390099
O  -3.7205351 -3.64676709 0.22134493
C  -5.12068617 -1.29278973 0.03328963
C  -6.19407378 -2.05472141 -0.41990585
C  -5.29821992 -0.25102216 0.93837564
C  -7.47130362 -1.76147089 0.05553119
H  -6.0308123 -2.86273592 -1.13411915
C  -6.58169069 0.03710747 1.39925739
H  -4.43331735 0.32340201 1.27461634
C  -7.6696101 -0.71820002 0.9615326
H  -8.32096207 -2.35350959 -0.2921641
H  -6.72606969 0.85690081 2.10684173
H  -8.67474654 -0.49344227 1.32477318
C  -1.41528269 -4.7941735 -1.92650135
H  -0.79910804 -5.70090799 -1.84007435
H  -2.47225025 -5.09516525 -1.923822
H  -1.19962761 -4.31484559 -2.89272257
C  0.07177691 -2.22110608 3.09483549
C  -0.19477102 -2.36381786 1.61679089
C  0.71324737 -2.86557873 0.71706831
C  2.12223304 -3.16767731 1.15958995
C  2.48017102 -2.63947401 2.53779152
C  1.35708762 -2.91767655 3.52493155
H  -1.24958998 -2.31595089 1.33362869
H  0.08034502 -1.15933234 3.38680944
H  2.21589278 -4.26944974 1.14383506
H  2.84212295 -2.82195321 0.40294089
H  3.4216263 -3.10084539 2.87238047
H  2.66682818 -1.557809 2.47266557
H  1.18249461 -4.00647178 3.57293054
H  1.63556001 -2.60376422 4.54267161
H  -0.79401437 -2.65481177 3.62129506
C  4.4763607 -2.36581003 -2.46308901
C  4.14278779 -0.87182029 -2.1038587
C  1.8114081 1.62412354 3.6618092
C  3.05884763 1.45482909 2.70237077
B  1.17796967 0.59559986 1.71913678
B  2.28343367 -2.16807351 -1.93173732
O  2.53457692 0.63000104 1.6289065
O  0.69818939 1.21331599 2.8299762
O  2.69354409 -0.87678128 -2.08409474
O  3.3042317 -3.06865776 -1.98936112
C  4.24333192 0.73470841 3.32161882
H  5.03044118 0.61625991 2.56312988
H  4.65746796 1.32287614 4.15310121
H  3.9807985 -0.26083836 3.69819614
C  3.52992867 2.75726065 2.07902279
H  3.98306121 3.41365635 2.83475409
H  4.28860391 2.53551472 1.31577031
H  2.70922892 3.29675813 1.5933499
C  1.54625185 3.04970854 4.10961307
H  1.38058958 3.71746999 3.25476306
H  0.64592196 3.07111577 4.7403251
H  2.38774214 3.43628555 4.70197337
C  1.83209789 0.69571006 4.86569755
H  1.99455882 -0.34908307 4.57162268
H  2.6208244 0.98214367 5.57483878
H  0.86384953 0.75794784 5.38264209
C  5.70008722 -2.92707871 -1.76744456
H  5.59900453 -2.89291968 -0.67530013
H  5.84486118 -3.9752219 -2.06636055
H  6.60002257 -2.36392951 -2.05454038
C  4.61090269 -0.46931397 -0.71398874
H  4.17174353 0.50021602 -0.44581318
H  4.28739687 -1.18948389 0.04984265
H  5.70554205 -0.38358123 -0.67413746
C  4.60940944 0.14118487 -3.13047463
H  4.34134115 1.15415691 -2.79908497
H  5.70259315 0.10211271 -3.24250527
H  4.14783968 -0.03022748 -4.11088453
C  4.55514318 -2.61759958 -3.96290241
H  3.67293818 -2.21754572 -4.48392726
H  5.45540933 -2.16536375 -4.40128942
H  4.59278605 -3.70211511 -4.13922012
