program: Gaussian 16
title: Title
version: ES64L-G16RevA.03
frameworkgroup: C1[X(CF3O3S)]
method: RPBE1PBE
basis: def2SVP
operation: Freq
keyword: #N
keyword: Geom=AllCheck
keyword: Guess=TCheck
keyword: SCRF=Check
keyword: GenChk
keyword: RPBE1PBE/def2SVP
keyword: Freq
converged: YES YES YES YES
title: Mulliken charges:
elementType: O S O O C F F F
charge: -0.586343 0.867432 -0.586363 -0.586253 0.453749 -0.187186 -0.187512 -0.187523
chargesum: -1.00000
title: Mulliken charges with hydrogens summed into heavy atoms:
1716.lowfreq: -0.0029 -0.0018 0.0020 1.8696 8.2130 16.3529 56.2614 191.8906 192.1100
frequency: 55.6872 191.8808 192.1003 307.4293 343.3363 343.8198 505.5751 506.1657 575.6219 575.9941 622.5129 774.5937 1039.4042 1215.8121 1216.8077 1256.6911 1280.6658 1280.7198
redmass: 17.4525 17.2515 17.2569 18.0173 17.5642 17.5661 17.8210 17.8263 18.1432 18.1420 21.1553 18.3477 16.2439 13.3019 13.3056 13.8162 20.2223 20.2177
irintensity: 0.0003 4.2739 4.3935 0.8653 0.4588 0.4398 41.8228 41.5144 7.9289 7.9946 270.1522 3.9715 234.1353 230.6115 229.0521 118.8943 556.1636 558.2206
temp: 298.150 k
press: 1.00000 atm
elementType: 8 16 8 8 6 9 9 9
symmnumber: 1
zpe: 73479.5 jmol-1
zpe.correction: 0.027987 hartree
zpe.thermalcorrener: 0.035059 hartree
zpe.thermalcorrenthalpy: 0.036003 hartree
zpe.thermalcorrgfe: -0.004435 hartree
zpe.sumelectzpe: -960.323596 hartree
zpe.sumelectthermal: -960.316525 hartree
zpe.sumelectthermalent: -960.315580 hartree
zpe.sumelectthermalfe: -960.356018 hartree
dipole: -4.9257 0.0017 -0.0008
dipole: 4.9257
quadrupole: -58.7208 -58.2043 -58.2058
quadrupole: -0.0047 -0.0002 0.0001
quadrupole: -0.3438 0.1727 0.1712 -0.0047 -0.0002 0.0001
hfenergy: -960.3515834 hartree
pointgroup: C01 [X(C1F3O3S1)]
dipole: -1.937515 -0.0392718 -0.0001467 debye
dipolederiv: -0.9189109 0.0940595 -0.1618116 0.1579682 -0.9932616 0.2995731 -0.2686259 0.2976809 -1.3264156 2.1162369 -0.0123597 -0.0006232 -0.0130663 2.7221193 -0.0009314 -0.0009786 -0.0005501 2.7216572 -0.9206955 0.091613 0.1655924 0.1516742 -0.979162 -0.2896378 0.2733856 -0.2889773 -1.3435778 -0.9052281 -0.1699155 -0.0015844 -0.293831 -1.5174017 -0.0087112 -0.003538 -0.00932 -0.8197063 1.7084497 -0.001147 -0.0005057 -0.0011888 1.7685223 0.0000081 0.0002222 0.0000681 1.7683436 -0.6786388 -0.3976372 -0.0058747 -0.3231639 -1.0255665 -0.0088337 -0.0041925 -0.0085094 -0.3225131 -0.7006407 0.2027335 -0.353181 0.1643244 -0.4944868 0.2945442 -0.2896869 0.2963915 -0.8320523 -0.7005725 0.1926534 0.3579881 0.1572831 -0.4807631 -0.2860115 0.2934142 -0.2867836 -0.8457357 unknown
polarizability: 38.4223205|-0.0540292|40.7664154|0.0000563|-0.0019463|40.7645717 unknown
InChI: InChI=1/C.3F.3O.S
charge -1 multiplicity 1
8 atoms
O  1.25188327 -0.71603697 1.23302935
S  0.9100771 0.01113396 0.00017736
O  1.2516817 -0.68294574 -1.25164416
O  1.20856267 1.451891 0.01934723
C  -0.94026141 -0.02609867 -0.00022801
F  -1.39336433 -1.2791614 -0.01568216
F  -1.43140889 0.59953699 -1.06972912
F  -1.43137111 0.57297283 1.08442451
