program: Gaussian 16
title: Title
version: ES64L-G16RevA.03
frameworkgroup: C1[X(C7H12BF3O5S)]
method: RPBE1PBE
basis: def2SVP
operation: Freq
keyword: #N
keyword: Geom=AllCheck
keyword: Guess=TCheck
keyword: SCRF=Check
keyword: GenChk
keyword: RPBE1PBE/def2SVP
keyword: Freq
converged: YES YES YES YES
title: Mulliken charges:
elementType: O S O O C F F F C C B O O C H H H C H H H C H H H C H H H
charge: -0.439571 0.894964 -0.348777 -0.431598 0.510389 -0.140366 -0.129182 -0.136418 -0.138187 -0.131675 0.213180 -0.281901 -0.242613 0.018092 0.058964 0.061154 0.055458 0.033195 0.061972 0.056703 0.052756 0.033496 0.061699 0.056500 0.051706 0.022017 0.059627 0.060797 0.057621
chargesum: 0.00000
title: Mulliken charges with hydrogens summed into heavy atoms:
elementType: O S O O C F F F C C B O O C C C C
charge: -0.439571 0.894964 -0.348777 -0.431598 0.510389 -0.140366 -0.129182 -0.136418 -0.138187 -0.131675 0.213180 -0.281901 -0.242613 0.193667 0.204626 0.203400 0.200061
1716.lowfreq: -4.1972 -0.0013 -0.0005 0.0025 3.7604 9.4478 29.3451 46.0233 47.6392
frequency: 29.2054 45.8694 47.5739 76.5993 108.1842 116.1047 193.9939 213.1040 228.2963 235.1727 253.3088 279.5912 291.9069 302.7752 314.8671 316.8086 323.6811 331.4306 355.4540 368.1612 374.3293 412.3148 431.4755 487.8173 522.6690 531.4870 563.0280 578.8345 582.3301 590.0800 639.9617 660.3938 689.2561 780.0568 820.1743 868.9978 876.4832 941.0860 942.0192 964.6979 974.7701 1000.8832 1003.4188 1040.8822 1136.6367 1142.1622 1169.0615 1198.6193 1241.3392 1253.9785 1274.3312 1285.1024 1293.7500 1301.5072 1386.7141 1393.0077 1393.1296 1399.9535 1406.7232 1418.1575 1437.1031 1442.0427 1443.5388 1444.9609 1457.8164 1465.2653 1471.7542 1474.9509 1483.7895 3068.3349 3069.5886 3074.5851 3076.1773 3167.4734 3168.7955 3169.9273 3171.0959 3179.6839 3181.0157 3188.7347 3189.4213
redmass: 4.9473 10.8859 9.1523 6.5552 4.1413 5.0144 6.4732 16.8754 2.5561 1.4356 1.2207 3.5376 3.3426 2.8799 2.7889 1.5470 1.1188 9.9508 2.9504 2.3912 3.6816 3.7410 4.2095 4.4215 4.6988 3.6089 13.3777 16.7992 13.8931 3.9384 8.0294 9.9019 3.4593 14.8508 11.7297 3.6353 3.0729 1.4757 1.4064 2.2082 1.7237 1.3276 1.4642 3.2944 2.3594 10.4071 2.9559 2.6800 13.0237 2.8797 12.7336 2.5288 13.1860 2.8510 1.3463 1.3852 1.6404 1.5372 3.7982 17.3648 1.0626 1.1282 1.0662 1.3062 1.1672 1.1725 1.1270 1.9210 1.0715 1.0370 1.0369 1.0379 1.0381 1.1050 1.1049 1.1043 1.1041 1.1046 1.1046 1.1043 1.1043
irintensity: 0.1598 0.2694 0.3759 0.4111 0.1968 0.3921 3.8575 4.5786 0.7249 0.8144 0.1212 3.4138 3.2063 1.1404 1.3996 0.4879 0.1594 1.3834 0.7721 0.8065 2.1292 8.2808 8.8572 44.0064 33.7819 22.6175 21.4550 47.1748 60.4584 7.6663 83.5156 125.4672 36.1382 83.7592 205.0794 36.0835 166.9071 1.5096 0.8099 114.6142 7.1639 0.4281 11.3761 50.8831 4.9839 577.3815 319.0145 57.2372 127.7759 21.7473 506.6527 1.0219 267.5160 34.0699 50.6855 22.7604 53.2727 357.6961 475.0366 363.5090 0.8958 58.7367 3.4408 213.6506 82.0565 39.2893 52.4153 146.7883 8.7357 8.6579 11.8789 11.6796 6.8305 8.5450 5.0084 2.7344 35.9599 10.8275 17.9171 10.3923 14.1124
temp: 298.150 k
press: 1.00000 atm
elementType: 8 16 8 8 6 9 9 9 6 6 5 8 8 6 1 1 1 6 1 1 1 6 1 1 1 6 1 1 1
symmnumber: 1
zpe: 557637.8 jmol-1
zpe.correction: 0.212393 hartree
zpe.thermalcorrener: 0.229613 hartree
zpe.thermalcorrenthalpy: 0.230557 hartree
zpe.thermalcorrgfe: 0.167323 hartree
zpe.sumelectzpe: -1370.549031 hartree
zpe.sumelectthermal: -1370.531811 hartree
zpe.sumelectthermalent: -1370.530867 hartree
zpe.sumelectthermalfe: -1370.594101 hartree
dipole: 6.4648 3.6644 -0.3256
dipole: 7.4382
quadrupole: -96.6613 -104.6701 -107.9995
quadrupole: -4.6375 2.5120 -2.1869
quadrupole: 6.4490 -1.5598 -4.8892 -4.6375 2.5120 -2.1869
hfenergy: -1370.761424 hartree
pointgroup: C01 [X(C7H12B1F3O5S1)]
dipole: 2.4081688 1.6618319 0.0543509 debye
polarizability: 153.6843894|4.1898307|134.7784444|0.8871664|2.1358511|131.1014893 unknown
InChI: InChI=1/7C.B.3F.5O.S.12H
charge 0 multiplicity 1
29 atoms
O  -2.09446216 -1.61786103 -0.54728349
S  -1.07979185 -0.9140118 0.19661263
O  0.28333006 -1.11504658 -0.62220975
O  -0.8641705 -1.13437552 1.60719766
C  -1.4029887 0.92766843 -0.04945678
F  -0.69070873 1.38633046 -1.06109474
F  -1.09636884 1.5789015 1.04701603
F  -2.6842941 1.06665306 -0.31148804
C  3.66206044 -0.00732953 -0.28786022
C  2.87020235 1.05242694 0.5629473
B  1.48193597 -0.47820811 -0.28009955
O  1.58662413 0.39033131 0.74666026
O  2.59282006 -0.6795587 -1.0136396
C  2.58615431 2.33888064 -0.19761986
H  1.84677378 2.92644668 0.36473085
H  3.49594337 2.9435868 -0.31277036
H  2.17263624 2.13527936 -1.19611686
C  3.46441954 1.34853157 1.92262781
H  4.4764819 1.76484139 1.81481546
H  2.84371383 2.09217483 2.44242923
H  3.5177744 0.44799449 2.5470564
C  4.63156873 0.58454083 -1.28802775
H  5.39746367 1.18034998 -0.77062786
H  5.13964833 -0.22332446 -1.83361563
H  4.12055582 1.2246465 -2.01805263
C  4.34135886 -1.06671846 0.56619353
H  4.69060485 -1.87963446 -0.08596658
H  5.2090928 -0.65384162 1.09854497
H  3.64742528 -1.49302938 1.30549605
