program: Gaussian 16
title: Coordinates from ORCA-job ts4RE_PdPPh3R1R2R3_f E -113.893879058210
version: ES64L-G16RevC.01
method: RPBE1PBE
basis: def2SVP
operation: Freq
keyword: #N
keyword: Geom=AllCheck
keyword: Guess=TCheck
keyword: SCRF=Check
keyword: GenChk
keyword: RPBE1PBE/def2SVP
keyword: Freq
converged: YES YES NO YES
title: Mulliken charges:
elementType: C C C C C H H H H H N C O O C C C C H C H C H H H C H H H C C C C C C H H H H H H H H C C B O O H C H H H C H H H C H H H C H H H
charge: -0.032193 0.062307 -0.070152 -0.086815 0.024080 0.064371 0.069949 0.038809 0.031718 0.039243 -0.314660 0.465964 -0.284387 -0.307396 0.166501 -0.032694 -0.028129 -0.042276 0.053468 -0.036785 0.041228 -0.017789 0.047292 0.049266 0.044610 0.025961 0.055479 0.055584 0.048145 0.020150 -0.128270 -0.190360 0.037687 -0.068273 -0.060186 0.038571 0.041863 0.040701 0.046391 0.044552 0.035366 0.036184 0.036815 -0.103199 -0.110607 0.208431 -0.334504 -0.325720 0.037617 0.031115 0.041128 0.036942 0.034939 0.017194 0.042104 0.036574 0.048683 0.029511 0.041319 0.037736 0.034107 0.015219 0.036634 0.038371 0.044521
chargesum: -0.00000
title: Mulliken charges with hydrogens summed into heavy atoms:
elementType: C C C C C N C O O C C C C C C C C C C C C C C C B O O C C C C
charge: 0.032178 0.132256 -0.031343 -0.055098 0.063322 -0.314660 0.465964 -0.284387 -0.307396 0.166501 0.020774 0.013099 0.005017 0.012481 0.026821 0.185168 0.099630 -0.089699 -0.190360 0.124778 0.011644 0.012813 -0.103199 -0.110607 0.208431 -0.334504 -0.325720 0.144124 0.144554 0.142673 0.134745
1716.lowfreq: -5.8070 -1.6097 0.0005 0.0006 0.0007 5.0224 15.6111 23.9989 28.2290
frequency: 15.4281 23.9332 28.0732 34.0896 37.8075 59.2249 64.5740 81.7775 91.9980 108.2191 137.6609 150.7202 169.0900 179.4025 200.9141 211.6384 224.6552 229.1937 233.5932 242.9913 255.9152 260.0685 280.7236 290.2773 303.4632 308.6296 315.9779 320.2410 325.7328 332.5568 355.6693 365.1995 370.0425 394.6939 417.5447 427.9331 434.8113 456.2197 462.4964 487.0112 495.8204 509.6350 527.2417 529.7540 534.5798 550.0747 590.7183 600.4518 610.5436 624.0954 651.8405 665.0557 684.5265 689.6378 714.4085 718.8152 753.4533 764.3316 775.5811 810.8761 818.7181 827.9043 848.0349 851.7367 855.7826 868.5339 876.4520 894.3570 900.4047 907.3199 928.6963 929.5719 933.0948 940.0597 949.0653 958.5749 977.3711 985.9222 988.6094 994.4867 996.3759 1001.9730 1002.8522 1009.0181 1019.3173 1028.5762 1032.4488 1051.9147 1055.3427 1072.4431 1086.3975 1096.2540 1100.4145 1102.3288 1118.4153 1120.1993 1140.4069 1145.0594 1157.7993 1162.3596 1169.3247 1174.0578 1184.4504 1186.0287 1198.7741 1208.7718 1220.3688 1248.1324 1252.1551 1263.7155 1266.8492 1269.4352 1282.4431 1284.7672 1298.4476 1305.5160 1314.8793 1320.9096 1325.2599 1331.4745 1342.9223 1366.3336 1372.3493 1379.1278 1379.8213 1381.6317 1383.1779 1384.2043 1390.4485 1400.6272 1404.9197 1411.3319 1421.8771 1429.8247 1434.8790 1436.2118 1440.4798 1444.0665 1447.7227 1449.9821 1451.2340 1459.1828 1461.4973 1462.2613 1463.7076 1465.9508 1480.3175 1495.5712 1531.3361 1589.8243 1679.2126 1688.2840 1715.1310 1744.1375 1755.0272 3028.0538 3037.3393 3037.7773 3047.6084 3050.6654 3051.1773 3056.9659 3059.9964 3061.8096 3064.7041 3068.6358 3080.9076 3082.2119 3112.5871 3115.2676 3140.0765 3150.9645 3152.2728 3156.1259 3157.6143 3162.5493 3170.2009 3174.3186 3175.2073 3177.3347 3177.6241 3187.7722 3189.9296 3207.6062 3214.8115 3223.2266 3232.6202 3239.7871 3257.6360
redmass: 4.6369 4.3684 4.3738 3.5225 3.8843 3.9947 3.8828 3.2533 3.6836 5.1492 3.8650 4.0251 3.4739 3.7675 3.1513 2.8891 1.2177 2.0959 1.5613 1.4021 2.3185 1.5998 3.7224 2.5636 3.0118 1.2070 2.6053 1.1689 2.1714 2.7045 2.3870 3.9098 2.3788 3.7997 3.3660 2.9473 4.5473 2.3551 3.8415 3.5894 2.9563 4.3575 3.7536 3.3169 3.5157 3.3274 3.7487 4.3509 4.0141 5.9508 5.1763 2.5498 3.0663 4.0743 1.9361 2.9520 3.7059 3.6750 1.8341 1.5019 2.5516 2.9464 1.3133 2.9171 3.2631 3.2758 2.2001 2.7938 2.5419 2.1113 2.0822 1.4414 1.4477 1.5135 1.4042 2.1358 1.6449 2.3374 1.8291 1.3456 1.4558 1.3790 1.5401 1.6127 4.6650 1.3349 1.8910 2.2234 1.9191 1.6416 1.8532 1.3040 1.3670 3.0621 1.8297 2.0080 1.7065 1.4542 1.7798 1.0897 1.6084 1.1507 2.5959 2.6898 2.3869 1.5601 3.8440 3.1163 1.3647 2.1952 1.8451 2.5172 3.0639 1.3112 2.5504 2.7137 1.3408 1.4383 1.3338 1.8852 1.5143 1.5356 1.3565 1.5232 1.7346 1.5932 1.4482 1.4034 1.3804 5.5268 2.0676 1.8873 2.0303 1.0958 1.0583 1.1139 1.0518 1.0579 1.0594 1.1176 1.0570 1.0499 1.1163 1.0838 1.0763 1.0789 1.0685 2.6026 2.6997 9.7963 6.9794 7.0460 10.7705 7.6254 7.5526 1.0668 1.0816 1.0675 1.0688 1.0712 1.0776 1.0364 1.0373 1.0379 1.0381 1.0371 1.0969 1.0977 1.1000 1.1050 1.0877 1.1044 1.1039 1.1033 1.1041 1.1043 1.1050 1.1035 1.1039 1.1033 1.1034 1.0861 1.0914 1.0995 1.0871 1.0918 1.0963 1.0996 1.0955
irintensity: 0.1485 0.2396 0.5800 0.0706 0.5197 0.2593 0.7893 0.3889 0.9585 1.0662 4.2137 0.1349 1.9211 12.0944 3.2596 1.0989 0.0363 1.5091 0.7860 1.0534 2.4827 1.8260 9.9084 1.0542 1.9854 3.8297 5.2627 0.3739 8.8594 4.6107 3.3725 12.5643 1.2123 1.0995 27.6951 0.1674 107.2358 15.8750 0.0766 33.4138 36.6141 13.7416 1.3987 11.2091 1.0959 11.7951 6.1824 57.9441 111.6290 2.5082 11.1795 114.5168 5.5774 5.8172 43.3401 36.0622 19.9197 84.1022 89.9904 5.9998 24.6251 9.9902 4.2049 9.5657 26.6261 28.3222 11.4986 2.2745 2.5531 29.7631 8.0733 0.6965 2.5420 7.9809 18.2647 5.2746 4.8497 4.8311 16.5779 6.7913 1.5259 0.4956 7.0077 14.0600 13.7928 1.1119 19.9251 5.0662 31.6125 2.4021 0.4965 6.1236 14.0227 83.5949 40.8443 9.3267 90.8838 31.7975 156.0213 2.6586 10.7263 19.1904 698.9746 75.9088 80.6160 0.4738 113.3961 303.2643 1.6556 114.4121 60.7760 31.8374 240.6056 39.4563 114.4237 101.4776 56.5750 11.0960 0.6822 10.4975 10.0806 1.2408 43.6343 2.6559 2.2290 9.7906 14.8119 26.1524 26.3879 7.9907 3.6736 49.9178 1.4022 1.2810 1.1062 16.0655 3.2880 2.2310 5.0154 6.4956 10.0624 7.5827 5.2357 8.5411 4.1364 2.4555 7.7697 8.7005 445.5785 949.3192 20.3494 67.1300 736.2865 61.4422 2.1859 50.2922 44.8626 57.8241 28.8112 28.9736 52.7658 19.7841 22.2180 26.7584 26.0772 27.7588 68.9933 19.7828 60.2557 58.8717 4.6894 1.7551 16.2917 54.9309 36.1362 36.3786 14.9229 17.1779 10.7594 23.6598 28.8983 5.3356 2.0474 27.0588 0.0697 6.5414 9.6666 1.7247 0.6589
temp: 298.150 k
press: 1.00000 atm
elementType: 6 6 6 6 6 1 1 1 1 1 7 6 8 8 6 6 6 6 1 6 1 6 1 1 1 6 1 1 1 6 6 6 6 6 6 1 1 1 1 1 1 1 1 6 6 5 8 8 1 6 1 1 1 6 1 1 1 6 1 1 1 6 1 1 1
symmnumber: 1
zpe: 1467698.3 jmol-1
zpe.correction: 0.559017 hartree
zpe.thermalcorrener: 0.587971 hartree
zpe.thermalcorrenthalpy: 0.588915 hartree
zpe.thermalcorrgfe: 0.499235 hartree
zpe.sumelectzpe: -1350.765238 hartree
zpe.sumelectthermal: -1350.736283 hartree
zpe.sumelectthermalent: -1350.735339 hartree
zpe.sumelectthermalfe: -1350.825020 hartree
dipole: 4.5340 0.1064 -0.1262
dipole: 4.5370
quadrupole: -175.3001 -170.6026 -180.4487
quadrupole: -3.1046 -10.8560 -7.0256
quadrupole: 0.1504 4.8479 -4.9982 -3.1046 -10.8560 -7.0256
hfenergy: -1351.3242545 hartree
pointgroup: C01 [X(C25H34B1N1O4)]
dipole: -0.7781833 0.0727114 1.6048072 debye
polarizability: 392.5675271|-26.7508497|375.3138248|-14.9661645|-26.288213|367.0127363 unknown
InChI: InChI=1/25C.B.N.4O.34H
charge 0 multiplicity 1
65 atoms
C  -2.64424382 -1.89410339 0.67001531
C  -2.04460987 -1.54669117 -1.76935079
C  -0.72536467 -1.09989933 -1.24553228
C  -0.51187151 -0.76846367 0.03373134
C  -1.58550414 -0.84559932 1.0845596
H  -3.53905878 -1.77107442 1.2938863
H  -1.95400121 -2.55766883 -2.21025801
H  0.08953648 -1.04447038 -1.97351875
H  0.47280373 -0.408378 0.34606208
H  -1.13395802 -1.20054175 2.02833451
N  -3.03389174 -1.57415756 -0.69409438
C  -4.14277422 -0.94885239 -1.04435272
O  -5.10854854 -0.863621 -0.1485811
O  -4.24386331 -0.49300628 -2.20897549
C  -6.21235619 -0.04535994 -0.33810561
C  -6.09637004 1.24592536 -0.84628079
C  -7.4334717 -0.55686643 0.08617981
C  -7.24245088 2.03395622 -0.93296045
H  -5.12995352 1.62483053 -1.17643049
C  -8.56985843 0.2455429 -0.00263927
H  -7.47892998 -1.57196865 0.48436982
C  -8.47815716 1.54031336 -0.51314125
H  -7.16210942 3.0478066 -1.33147248
H  -9.53280607 -0.14817242 0.33002198
H  -9.37008984 2.16650638 -0.58281149
C  -2.16099996 -3.33007145 0.77825455
H  -1.92383535 -3.56391411 1.82577191
H  -2.94067183 -4.02600618 0.4364121
H  -1.25483849 -3.49526812 0.17785585
C  -2.93225216 2.82019174 0.75563116
C  -2.27490245 1.49690076 0.49888496
C  -2.2560465 0.48298836 1.37990727
C  -2.95260278 0.58471366 2.71214352
C  -3.97310258 1.71425066 2.75114384
C  -3.3653093 2.9996284 2.20656354
H  -1.78879104 1.364965 -0.47333363
H  -2.24742263 3.63137498 0.4536316
H  -3.43812619 -0.37723754 2.95184559
H  -2.19244705 0.7269852 3.50380133
H  -4.84578798 1.4343003 2.1341288
H  -4.34386214 1.85899183 3.77802933
H  -4.07376193 3.83846816 2.29225999
H  -2.48726515 3.26644008 2.82100709
C  -2.37979114 -0.00184557 -5.1119113
C  -2.45502161 1.29419413 -4.23037189
B  -2.7073043 -0.54840254 -2.89863116
O  -2.204128 0.7739602 -2.92854294
O  -2.86409842 -1.00947734 -4.22655415
H  -3.8043258 2.92564039 0.08388006
C  -3.24610971 0.03232234 -6.35881272
H  -2.94845834 0.85805849 -7.02294999
H  -3.13220117 -0.90916432 -6.91718411
H  -4.30789417 0.1506413 -6.10596003
C  -3.84129635 1.937368 -4.24762084
H  -3.88533646 2.69715158 -3.45252944
H  -4.04993179 2.43322205 -5.20680076
H  -4.62984386 1.19825089 -4.05191983
C  -1.40386278 2.34209826 -4.55248371
H  -1.49553136 2.68668072 -5.59369711
H  -1.53650775 3.21402271 -3.89416891
H  -0.38912383 1.95257159 -4.39844586
C  -0.94428415 -0.36406349 -5.48586933
H  -0.93448477 -1.3831243 -5.90024429
H  -0.52517165 0.31894153 -6.23912506
H  -0.29341504 -0.3498844 -4.59908597
