program: Gaussian 16
title: Title
version: ES64L-G16RevA.03
method: RPBE1PBE
basis: def2SVP
operation: Freq
keyword: #N
keyword: Geom=AllCheck
keyword: Guess=TCheck
keyword: SCRF=Check
keyword: GenChk
keyword: RPBE1PBE/def2SVP
keyword: Freq
converged: YES YES YES YES
title: Mulliken charges:
elementType: P C C C C H C H C H H H C C C C H C H C H H H C C C C H C H C H H H
charge: 0.373158 -0.226625 -0.009962 -0.019423 -0.041929 0.044252 -0.036230 0.050300 -0.036571 0.051537 0.049043 0.051926 -0.225711 -0.010255 -0.020316 -0.041880 0.044302 -0.036331 0.050522 -0.036858 0.051454 0.048885 0.051793 -0.226330 -0.020417 -0.010583 -0.035942 0.050443 -0.041787 0.044302 -0.036816 0.048855 0.051427 0.051769
chargesum: -0.00000
title: Mulliken charges with hydrogens summed into heavy atoms:
elementType: P C C C C C C C C C C C C C C C C C C
charge: 0.373158 -0.226625 0.034289 0.030877 0.009608 0.012813 0.015355 -0.225711 0.034047 0.030206 0.009573 0.012554 0.014935 -0.226330 0.030026 0.033719 0.012913 0.009640 0.014953
chargesum: 0.00000
1716.lowfreq: -7.6052 -5.8155 -4.1091 -0.0009 -0.0005 0.0015 18.6123 24.6514 46.3506
frequency: 18.3816 24.5617 46.3374 52.0581 53.1694 65.8589 187.0283 202.8896 204.5402 251.6633 265.2274 265.8418 408.5793 410.4165 412.6155 416.1391 438.1705 438.3344 512.0728 513.2846 521.6810 627.4266 627.5264 627.5565 698.7389 715.1255 715.2413 722.4042 723.7204 724.3510 774.9932 775.7048 776.6327 872.7053 873.4763 874.9469 950.7665 951.8405 952.8587 1012.1345 1012.1564 1012.9147 1013.8227 1014.4255 1015.2606 1036.0970 1037.2602 1037.8730 1056.4420 1056.6112 1056.6938 1100.0095 1100.4835 1100.7424 1125.2321 1125.2774 1130.7933 1156.0037 1156.6096 1156.7657 1182.0501 1182.6188 1183.6487 1315.8859 1318.3344 1318.8767 1385.7269 1388.7094 1388.8913 1468.3186 1469.8870 1470.1463 1514.0097 1514.2108 1514.5050 1653.0574 1654.3070 1654.4961 1669.5174 1669.6261 1671.4751 3193.3860 3193.7819 3194.9188 3205.1059 3205.2153 3205.4490 3212.9452 3213.2981 3213.7439 3219.4897 3219.6107 3219.9839 3227.9337 3228.0760 3228.4156
redmass: 3.7421 3.7421 3.6846 5.1964 5.2434 5.1462 4.5028 4.5939 4.5869 5.4778 4.6865 4.7023 2.8746 2.9260 4.4146 3.4914 7.6109 7.6199 3.8822 3.8608 4.0328 6.3580 6.3656 6.3679 6.3579 6.2318 6.2919 1.5890 1.5873 1.5891 2.0077 2.0073 2.0057 1.2519 1.2512 1.2507 1.3822 1.3814 1.3812 1.8333 1.9837 3.2228 2.5788 2.4595 1.9744 1.3392 1.3406 1.3418 2.4511 2.4591 2.4669 1.4630 1.4661 1.4653 2.9627 2.9613 2.8910 1.0623 1.0627 1.0623 1.1070 1.1072 1.1054 1.3729 1.3541 1.3538 6.5710 7.0862 7.1245 2.4139 2.4296 2.4273 2.3121 2.3178 2.3340 6.3184 6.3582 6.3640 6.4034 6.4051 6.4305 1.0902 1.0902 1.0900 1.0878 1.0877 1.0877 1.0921 1.0921 1.0921 1.0967 1.0966 1.0965 1.1011 1.1011 1.1011
irintensity: 0.3408 0.3487 0.0998 0.2006 0.1908 0.6972 0.5277 1.8860 1.9459 1.6308 0.9421 0.8928 1.7695 2.0526 1.8490 0.6587 11.8504 12.3104 53.3511 53.5888 46.2907 0.5491 0.6291 0.7948 1.9455 8.2306 8.4025 75.2158 75.7168 74.0186 26.4994 31.4663 32.0162 0.2448 0.2758 0.2642 2.2779 2.0128 1.8957 1.0310 2.1947 3.9062 4.4093 1.5642 0.5105 0.0403 0.0301 0.0487 12.7305 12.7523 5.3372 11.1090 10.8021 6.1943 28.2960 28.3618 4.9499 0.0421 0.0511 0.0893 4.1442 4.3163 0.4722 6.0381 3.1690 3.2285 0.0100 1.2076 1.2697 38.5625 19.9342 20.3228 22.2480 18.8829 10.1711 0.0039 0.2058 0.2335 3.8313 3.7089 0.0214 3.3433 3.4412 3.3746 0.0759 0.0705 0.0802 2.1432 3.4051 4.6671 9.3607 11.4134 13.2751 20.0067 15.8430 10.0387
temp: 298.150 k
press: 1.00000 atm
elementType: 15 6 6 6 6 1 6 1 6 1 1 1 6 6 6 6 1 6 1 6 1 1 1 6 6 6 6 1 6 1 6 1 1 1
symmnumber: 1
zpe: 723609.9 jmol-1
zpe.correction: 0.275608 hartree
zpe.thermalcorrener: 0.291413 hartree
zpe.thermalcorrenthalpy: 0.292357 hartree
zpe.thermalcorrgfe: 0.229186 hartree
zpe.sumelectzpe: -1034.531211 hartree
zpe.sumelectthermal: -1034.515406 hartree
zpe.sumelectthermalent: -1034.514462 hartree
zpe.sumelectthermalfe: -1034.577633 hartree
dipole: -1.1717 -1.8502 -0.2997
dipole: 2.2104
quadrupole: -106.1620 -102.8151 -105.1189
quadrupole: -0.0566 -0.6724 -0.5362
quadrupole: -1.4633 1.8835 -0.4202 -0.0566 -0.6724 -0.5362
hfenergy: -1034.8068193 hartree
pointgroup: C01 [X(C18H15P1)]
dipole: -0.4609731 -0.7279181 -0.1179039 debye
polarizability: 311.9562095|-27.7579017|285.1268419|-4.7711851|-6.8967976|329.5826132 unknown
InChI: InChI=1/18C.P.15H
charge 0 multiplicity 1
34 atoms
P  -0.12972557 -1.54898833 0.25335504
C  -1.09818738 -2.15937792 1.69156393
C  -1.77172899 -1.19881068 2.46059637
C  -1.19382521 -3.50871013 2.05428136
C  -2.54122298 -1.58128387 3.55756429
H  -1.69386562 -0.13986249 2.19500589
C  -1.9542815 -3.88889162 3.16054828
H  -0.67471176 -4.27092567 1.46786267
C  -2.63187616 -2.92844521 3.91153492
H  -3.06538769 -0.82264859 4.14474347
H  -2.02043842 -4.94526539 3.4342803
H  -3.22812077 -3.22896153 4.7770135
C  0.83401244 -3.04332679 -0.21250693
C  2.03712148 -3.26493142 0.47430616
C  0.44039755 -3.95153968 -1.2030343
C  2.81986226 -4.38219739 0.19069426
H  2.36208494 -2.55551603 1.24194522
C  1.23200365 -5.06291841 -1.49504082
H  -0.49288423 -3.79441672 -1.74936622
C  2.41968842 -5.28299867 -0.79781374
H  3.75210613 -4.54584849 0.73770057
H  0.91423619 -5.76410295 -2.27129917
H  3.03706078 -6.15532864 -1.02746959
C  -1.40672207 -1.49479436 -1.06771571
C  -2.69120062 -2.03716898 -0.93732753
C  -1.05539312 -0.85907496 -2.26805243
C  -3.6028749 -1.95089177 -1.99013032
H  -2.98338327 -2.53456734 -0.00918284
C  -1.96243697 -0.78532258 -3.32313245
H  -0.05880879 -0.41986647 -2.37770371
C  -3.24058553 -1.32933251 -3.18494521
H  -4.60316695 -2.37695601 -1.87555441
H  -1.67341493 -0.29202223 -4.25490264
H  -3.9561604 -1.26437016 -4.00872119
