program: Gaussian 16
title: Coordinates from ORCA-job ts4RE_PdPPh3R1R2R3_f E -113.893879058210
version: ES64L-G16RevC.01
method: RPBE1PBE
basis: def2SVP
operation: Freq
keyword: #N
keyword: Geom=AllCheck
keyword: Guess=TCheck
keyword: SCRF=Check
keyword: GenChk
keyword: RPBE1PBE/def2SVP
keyword: Freq
converged: YES YES YES YES
title: Mulliken charges:
elementType: C C C C C H H H H H N C O O C C C C H C H C H H H C H H H C C C C C C H H H H H H H H C C B O O H C H H H C H H H C H H H C H H H
charge: -0.040047 0.066277 -0.076801 -0.074359 0.037790 0.065586 0.088654 0.041013 0.035708 0.036870 -0.345259 0.381594 -0.328697 -0.337030 0.186594 -0.050625 -0.046814 -0.043498 0.043137 -0.038560 0.032979 -0.027267 0.041991 0.043248 0.038440 0.014527 0.050090 0.060407 0.055124 0.021803 -0.123249 -0.175251 0.038394 -0.069068 -0.062729 0.021133 0.041140 0.039793 0.045167 0.051476 0.033720 0.035491 0.036148 -0.138624 -0.132097 0.185429 -0.267112 -0.269791 0.040253 0.036451 0.055639 0.050597 0.044939 0.017201 0.058129 0.053683 0.053086 0.033181 0.055209 0.050569 0.046423 0.019609 0.053357 0.054387 0.054442
chargesum: -0.00000
title: Mulliken charges with hydrogens summed into heavy atoms:
elementType: C C C C C N C O O C C C C C C C C C C C C C C C B O O C C C C
charge: 0.025539 0.154931 -0.035788 -0.038651 0.074660 -0.345259 0.381594 -0.328697 -0.337030 0.186594 -0.007488 -0.013835 -0.001507 0.004688 0.011173 0.180148 0.103196 -0.102116 -0.175251 0.123354 0.016127 0.008910 -0.138624 -0.132097 0.185429 -0.267112 -0.269791 0.187626 0.182100 0.185382 0.181796
1716.lowfreq: -4.3180 -0.0006 0.0003 0.0006 2.0827 5.3526 11.4208 18.6340 26.4550
frequency: 11.3565 18.6264 26.4165 35.1477 42.7116 48.8987 60.9738 68.8194 74.4845 95.8820 105.0182 119.4984 136.5118 174.7566 179.5551 189.3622 211.2337 226.8659 234.4270 250.7645 252.2972 263.7968 267.4478 288.3401 298.2115 303.3002 315.2475 320.6857 324.8265 335.4389 348.6316 367.1283 376.5316 386.5602 401.5743 419.1372 425.8211 427.6601 456.7179 481.0464 493.7906 514.7487 525.1823 529.6559 537.0836 549.4220 554.6911 592.1617 600.0364 623.8211 638.4232 656.8756 677.6356 692.1376 713.8412 733.2608 757.2487 773.2953 790.6559 808.7105 823.8145 839.3748 847.4407 851.7710 860.1166 863.5272 869.1630 879.8244 896.0321 911.4946 930.6919 934.3085 938.8751 939.2038 939.7933 956.7779 971.9434 982.7785 987.8036 994.0588 998.9855 999.3663 1007.9764 1015.7726 1018.1306 1023.4852 1032.8473 1052.0786 1054.5220 1071.7754 1086.2238 1095.6326 1097.1752 1100.5381 1125.7120 1136.6993 1138.9867 1146.2680 1159.6884 1160.1641 1171.6886 1172.2572 1174.3688 1186.4999 1196.5331 1209.1275 1250.4287 1253.5042 1266.9601 1275.0006 1281.8388 1286.2975 1290.8704 1302.6278 1305.2465 1320.6075 1321.4756 1328.9862 1340.2874 1366.0175 1369.3879 1379.2079 1382.3046 1382.4766 1385.6578 1388.0021 1389.8766 1391.6320 1394.6527 1400.2330 1402.2430 1404.4682 1422.2242 1429.7785 1435.5250 1436.0820 1442.4579 1442.7922 1450.3874 1451.0306 1452.2593 1459.6640 1461.9697 1467.0059 1469.1138 1470.1557 1483.3932 1488.8728 1494.4627 1541.7724 1674.6116 1687.4806 1745.5790 1758.4910 1822.3860 3027.4216 3037.1304 3044.0259 3048.6439 3053.9832 3055.4512 3064.6585 3064.9748 3067.4275 3071.1788 3073.0370 3082.4307 3084.0802 3112.2115 3116.8243 3154.6495 3163.5535 3164.7625 3165.8394 3168.3505 3174.2388 3174.8843 3175.7128 3179.9017 3180.1540 3185.1271 3185.5003 3189.7930 3209.7656 3213.2037 3217.6328 3228.2614 3235.0525 3260.3600
redmass: 4.8597 3.6290 3.9991 4.2942 4.7636 4.8376 4.7481 3.5319 4.2880 3.6614 3.5078 4.1153 7.3959 2.8309 3.7895 3.9538 3.4947 2.3251 1.4007 1.2009 1.0776 2.3045 3.7269 2.2918 2.2981 2.6921 1.1213 1.6220 1.2944 3.3285 2.5511 2.8628 2.3377 3.3333 5.2062 3.2563 3.2094 2.9899 2.3653 3.6641 4.5732 3.3136 2.9518 3.3545 3.7226 3.6041 3.9100 3.8773 5.2415 5.7068 4.1416 2.2503 3.4190 3.5114 1.9359 2.2706 6.3014 1.9621 3.6753 1.4887 2.2035 4.1105 1.2940 3.6944 2.1135 3.1451 3.2006 2.5301 2.6048 2.4621 1.9462 1.5509 1.4685 1.4260 1.5062 2.0737 1.7191 1.7990 2.5659 1.3832 1.3262 1.3635 1.4298 1.7178 4.5096 1.3263 1.8254 2.3732 1.9954 1.5871 1.8521 1.3430 1.5266 2.1695 1.6486 1.6768 2.4484 1.5017 1.0776 1.2223 1.4702 1.3512 2.3800 1.6617 2.7407 1.5745 2.9095 1.3612 1.5274 2.0019 2.4815 1.3412 2.5671 2.8647 1.6171 1.4417 1.4212 2.2333 1.4444 1.5340 1.6239 1.7425 1.6642 1.6357 2.1759 1.8910 1.5969 1.5625 1.8469 1.8805 5.8420 2.6134 2.0306 1.1106 1.1130 1.0588 1.0545 1.0660 1.1157 1.0582 1.0816 1.0573 1.1216 1.0787 1.1125 1.1030 1.0806 3.2217 2.6520 3.0036 6.9438 6.8010 7.6039 7.7312 12.5086 1.0672 1.0656 1.0840 1.0677 1.0810 1.0644 1.0378 1.0368 1.0368 1.0379 1.0381 1.0961 1.0980 1.1008 1.1056 1.1007 1.1051 1.1045 1.1042 1.1043 1.1043 1.1021 1.1015 1.0936 1.0912 1.1040 1.1039 1.0873 1.0867 1.0987 1.0915 1.0956 1.0999 1.0951
irintensity: 0.3136 0.0335 0.4454 0.4853 0.3199 2.3577 1.1201 0.5513 0.3410 0.2819 0.0717 0.8021 1.6042 0.1470 0.9491 2.6147 5.4021 1.0579 0.3442 0.0638 0.5711 1.6277 2.7790 0.3741 2.3091 3.0828 0.0797 5.3132 1.1588 1.5320 0.7733 0.0211 0.2493 1.0578 16.0245 3.1104 2.4801 0.9867 1.4959 12.8355 7.2572 6.1589 1.9700 3.4867 2.4024 7.5373 30.4999 7.6132 4.2977 0.9079 8.9964 26.5100 3.3130 11.4632 46.7375 35.0248 13.4980 57.6540 112.7161 10.9334 4.1282 7.0330 1.4880 16.5373 3.8908 1.0421 3.1716 23.2828 11.0614 33.4940 16.5731 16.4808 6.3758 1.3024 6.5851 10.4027 4.7018 31.6043 5.3841 16.1790 0.0910 0.0878 2.3003 33.3661 5.7840 0.2574 12.1977 64.6960 106.9150 6.5533 3.5139 25.5283 20.5116 64.3576 104.4398 13.4210 4.5027 6.6681 1.4263 11.0399 4.7342 113.4826 297.8981 12.2478 52.3286 0.4070 27.7271 1.9755 99.2050 84.1772 2.3789 151.4186 459.1150 24.7616 50.0665 35.1623 11.1634 62.1571 1.9063 2.1061 184.4983 2.4785 35.9811 117.7372 388.3443 59.7461 10.2943 182.1878 273.3804 52.8536 43.2415 78.0178 18.1364 0.5759 18.3438 0.5056 4.3649 2.8410 5.7211 4.5406 8.4288 8.2351 6.1104 2.4447 67.7644 35.9386 24.4396 512.6174 24.3994 42.3557 12.8681 42.1747 25.7468 1.1627 823.5318 48.1406 50.9113 41.7571 43.8425 24.2478 25.4881 29.1907 10.1246 18.2067 15.9186 12.4751 65.2437 23.2372 58.5895 54.4948 14.2885 4.8512 1.3854 21.2902 39.7478 4.8601 40.3973 9.4657 3.4810 16.9716 12.7036 20.3955 7.6419 0.6676 17.9324 8.6685 14.5948 4.5649 0.7777
temp: 298.150 k
press: 1.00000 atm
elementType: 6 6 6 6 6 1 1 1 1 1 7 6 8 8 6 6 6 6 1 6 1 6 1 1 1 6 1 1 1 6 6 6 6 6 6 1 1 1 1 1 1 1 1 6 6 5 8 8 1 6 1 1 1 6 1 1 1 6 1 1 1 6 1 1 1
symmnumber: 1
zpe: 1468198.9 jmol-1
zpe.correction: 0.559207 hartree
zpe.thermalcorrener: 0.588668 hartree
zpe.thermalcorrenthalpy: 0.589612 hartree
zpe.thermalcorrgfe: 0.497473 hartree
zpe.sumelectzpe: -1350.757925 hartree
zpe.sumelectthermal: -1350.728465 hartree
zpe.sumelectthermalent: -1350.727521 hartree
zpe.sumelectthermalfe: -1350.819659 hartree
dipole: -2.9736 -1.3073 2.9866
dipole: 4.4127
quadrupole: -148.9019 -184.8531 -177.8423
quadrupole: -2.8256 -0.9876 3.2597
quadrupole: 21.6305 -14.3207 -7.3099 -2.8256 -0.9876 3.2597
hfenergy: -1351.3171329 hartree
pointgroup: C01 [X(C25H34B1N1O4)]
dipole: 0.4191784 -1.5226362 0.7209796 debye
polarizability: 368.7056265|-31.498316|402.9556818|-22.4600179|-3.8298201|355.7385807 unknown
InChI: InChI=1/25C.B.N.4O.34H
charge 0 multiplicity 1
65 atoms
C  -3.06414553 -2.2166793 0.71069218
C  -2.39268699 -2.48521399 -1.65713704
C  -1.00015718 -2.21118726 -1.17860138
C  -0.72617058 -1.71406265 0.03212745
C  -1.79646964 -1.39685072 1.03734521
H  -3.9045236 -1.81702568 1.28696615
H  -2.56131286 -1.90655127 -2.58482612
H  -0.19476116 -2.45755742 -1.87604498
H  0.31228055 -1.51751579 0.31540794
H  -1.44755068 -1.71953812 2.03528609
N  -3.38006353 -2.00925184 -0.69774738
C  -4.36075288 -1.19789017 -1.14221561
O  -5.1577313 -0.77850711 -0.11988947
O  -4.55367386 -0.89497093 -2.30199919
C  -6.03674554 0.26133395 -0.27673391
C  -5.74033129 1.39895566 -1.0294611
C  -7.22837594 0.17240065 0.44134584
C  -6.65509176 2.45001974 -1.05537831
H  -4.80847206 1.45568896 -1.59004132
C  -8.13133465 1.23344067 0.41126751
H  -7.42796589 -0.72877415 1.02437202
C  -7.84969953 2.37593139 -0.33792801
H  -6.42374481 3.34190485 -1.64274373
H  -9.06235179 1.16323455 0.97868803
H  -8.55818627 3.20673057 -0.3624681
C  -2.9199859 -3.69444073 1.04210503
H  -2.76849171 -3.81820126 2.12388121
H  -3.82463642 -4.24513441 0.75098352
H  -2.05462153 -4.1469394 0.53413189
C  -2.22335839 2.41011346 0.21111354
C  -1.89096399 0.94914031 0.14831349
C  -2.13223708 0.07754809 1.14040336
C  -2.80393011 0.50700609 2.41866748
C  -3.50669617 1.85211671 2.29203246
C  -2.59792251 2.8696494 1.61589103
H  -1.417608 0.58143461 -0.76845961
H  -1.3718618 2.99763717 -0.17316315
H  -3.52086718 -0.26910746 2.7378515
H  -2.04457018 0.54468622 3.22297157
H  -4.42279075 1.72660681 1.68860535
H  -3.82632504 2.20922167 3.28369103
H  -3.07688077 3.86068722 1.57723767
H  -1.68044666 2.98718369 2.21950522
C  -2.26108177 -5.92840296 -3.2040842
C  -3.6610697 -5.9608955 -2.49274201
B  -2.62894886 -3.98529797 -2.11142747
O  -3.85598006 -4.57194745 -2.13869434
O  -1.6311589 -4.78179524 -2.58606056
H  -3.05354035 2.62017729 -0.48866916
C  -1.39874694 -7.15160378 -2.96691587
H  -1.89572992 -8.05441819 -3.35125748
H  -0.4422154 -7.03812003 -3.49731898
H  -1.18389309 -7.29541275 -1.90045635
C  -3.65108791 -6.75475084 -1.19357319
H  -4.58887899 -6.56348451 -0.65231377
H  -3.57747006 -7.83444773 -1.38419024
H  -2.81542252 -6.45658837 -0.54452616
C  -4.81041425 -6.40741925 -3.37413214
H  -4.64642177 -7.43449036 -3.73195239
H  -5.74547911 -6.39399755 -2.79567609
H  -4.93581901 -5.74811782 -4.24230841
C  -2.35652695 -5.62445645 -4.69322019
H  -1.34855718 -5.41287787 -5.07799149
H  -2.7678671 -6.47582396 -5.253099
H  -2.98686005 -4.74317027 -4.88264959
