program: Gaussian 16
title: Title
version: ES64L-G16RevC.01
method: RPBE1PBE
basis: def2SVP
operation: Freq
keyword: #N
keyword: Geom=AllCheck
keyword: Guess=TCheck
keyword: SCRF=Check
keyword: GenChk
keyword: RPBE1PBE/def2SVP
keyword: Freq
converged: YES YES NO YES
title: Mulliken charges:
elementType: Pd C C C C C C H H H H H H H H O S O O C F F F H P C C C C H C H C H H H C C C C H C H C H H H C C C C H C H C H H H P C C C C H C H C H H H C C C C H C H C H H H C C C C H C H C H H H
charge: -0.050671 0.057722 -0.195175 -0.112544 0.044561 -0.072197 -0.089647 0.100514 0.043177 0.077726 0.075908 0.045756 0.047155 0.052234 0.045024 -0.508225 0.933945 -0.518665 -0.499825 0.488732 -0.163800 -0.169765 -0.169400 0.057063 0.355364 -0.162580 -0.016620 -0.003818 -0.031012 0.042219 -0.001605 0.043069 -0.025479 0.036535 0.034183 0.038614 -0.164801 -0.036850 -0.013908 -0.022413 0.076864 -0.024883 0.033361 -0.021003 0.038238 0.041438 0.044540 -0.168615 -0.023443 -0.021685 -0.023644 0.055475 -0.018606 0.065410 -0.018730 0.043620 0.041503 0.046293 0.366570 -0.143708 0.005941 -0.020003 -0.035055 0.043155 -0.021835 0.037757 -0.027856 0.038528 0.035211 0.040024 -0.145570 -0.045239 -0.016166 -0.017771 0.054967 -0.003292 0.033785 -0.024531 0.035660 0.034188 0.039290 -0.171518 -0.007560 -0.049989 -0.025103 0.048014 -0.012318 0.080709 -0.018251 0.045432 0.042595 0.047308
chargesum: -0.00000
title: Mulliken charges with hydrogens summed into heavy atoms:
elementType: Pd C C C C C C O S O O C F F F P C C C C C C C C C C C C C C C C C C P C C C C C C C C C C C C C C C C C C
charge: -0.050671 0.157962 -0.094661 -0.112544 0.198195 0.020714 0.007611 -0.508225 0.933945 -0.518665 -0.499825 0.488732 -0.163800 -0.169765 -0.169400 0.355364 -0.162580 0.025599 0.039251 0.005523 0.032578 0.013135 -0.164801 0.040014 0.019453 0.015825 0.016556 0.023537 -0.168615 0.032032 0.043725 0.019976 0.022897 0.027563 0.366570 -0.143708 0.049095 0.017754 0.003473 0.013375 0.012168 -0.145570 0.009728 0.017619 0.017889 0.030897 0.014758 -0.171518 0.040454 0.030720 0.020328 0.030277 0.029057
chargesum: 0.00000
1716.lowfreq: -188.1620 -0.7067 0.0011 0.0013 0.0015 1.9828 6.7847 13.6615 21.3704
redmass: 9.4254 6.1438 6.2163 6.1302 6.4346 8.6541 6.4263 7.8900 5.8074 4.6777 5.5617 5.0403 5.1421 5.6183 5.4191 4.6372 5.2327 5.6313 4.8548 5.0107 5.6618 5.8391 5.3906 4.8699 5.0784 4.9083 4.5842 5.8895 4.4778 5.8233 6.3556 4.7330 5.8977 6.1102 10.5440 9.2899 5.9146 5.8789 4.5329 4.3267 3.0375 4.6944 4.9614 5.3153 5.3792 5.2639 4.8365 4.8487 2.0874 16.7453 8.3661 11.1373 4.7950 2.8354 2.8456 2.8917 2.8537 2.8689 2.8751 2.9144 6.3816 6.2220 4.9989 3.2806 4.0935 5.8125 6.0694 12.3405 5.0262 5.3831 12.6823 4.8953 4.4007 4.4906 4.3394 3.1983 17.7165 17.0304 19.1949 6.3987 6.3942 6.3776 6.4052 6.3766 6.4397 2.3186 5.9329 6.1627 1.9537 2.0122 1.6596 3.1767 3.8397 1.8210 3.6182 2.1491 1.6137 1.9394 3.6034 1.8217 1.9172 1.8125 1.8441 1.9748 1.9585 16.8998 1.4621 2.8708 1.2527 1.2542 1.2446 1.2497 1.2471 1.2423 1.5604 2.3520 2.0998 1.3666 1.3702 1.3526 1.3614 1.3565 1.3418 3.0387 8.1922 1.4003 1.3870 5.2860 4.7223 5.8281 5.4810 5.3914 4.0327 1.4824 1.4765 1.4078 1.4538 1.3325 1.3275 1.3360 1.3324 1.3375 1.3359 1.4908 2.3694 2.4022 2.5125 2.4506 2.4761 2.4804 1.7937 1.2763 1.4641 1.4655 1.4845 1.5189 1.4846 1.5300 1.3682 2.9913 2.7693 2.8968 2.7836 2.9359 2.9067 1.0654 1.0629 1.0681 1.0687 1.0666 1.0707 1.5175 7.2408 1.1150 1.1172 1.1135 1.1175 1.1238 1.1202 12.7985 9.9991 2.0311 3.0602 1.4322 1.3307 11.4427 1.3673 1.3816 1.3527 1.3582 1.3505 1.3751 1.5911 1.6545 1.6330 1.5733 6.1760 6.5040 6.5161 5.9468 7.1317 7.0023 1.1007 1.1037 1.0951 1.1191 2.3868 2.3871 2.4095 2.3941 2.4359 2.4340 2.3153 2.3337 2.2891 2.2797 2.2841 2.2449 6.0670 6.1846 6.2172 6.1902 6.2038 6.3164 6.3399 6.2649 6.3441 6.3056 6.2410 6.3074 6.2595 1.0673 1.0679 1.0644 1.0686 1.0988 1.0996 1.1037 1.0967 1.0865 1.0920 1.0920 1.0906 1.0899 1.0876 1.0862 1.0884 1.0879 1.0881 1.0877 1.0889 1.0894 1.0910 1.0917 1.0917 1.0927 1.0934 1.0935 1.0963 1.0963 1.0959 1.0960 1.0970 1.0959 1.1008 1.1008 1.0999 1.1005 1.1006 1.0976
irintensity: 425.8807 0.3591 0.8032 0.1629 0.6310 1.0945 1.3292 0.4953 0.2910 0.0778 1.0122 0.3031 1.5789 0.7432 2.0654 0.0083 0.7172 3.1584 2.8493 2.8279 6.4474 5.4888 0.4163 0.3334 0.3164 0.2606 0.2238 3.3510 4.3408 2.1643 3.3462 1.4157 3.8767 1.2110 2.9928 8.3458 1.7508 5.8489 1.4273 1.7892 0.8258 0.8505 1.8119 1.8338 1.3312 2.8926 2.3449 0.6291 42.7026 8.6612 30.5005 6.9836 20.1509 0.5719 1.7370 22.5103 10.4352 4.1295 0.2773 0.1686 34.1818 29.1300 16.7824 8.3716 46.7668 14.1719 18.5476 74.5572 98.5423 32.2910 86.9284 94.3280 151.7472 157.5688 77.6700 29.7873 7.8776 22.8985 291.7639 0.5363 2.1743 1.0724 2.6536 2.2002 1.2735 204.0116 20.4457 6.0526 76.7584 67.8040 102.9936 1.5070 13.4004 87.2326 40.0403 35.8128 97.4220 13.1480 22.0508 15.3238 22.0768 10.4019 4.7527 13.8120 15.3430 1.0141 49.3679 32.8712 1.7513 1.9535 0.6733 1.0544 1.1584 0.9866 18.1835 34.1614 29.5959 2.9202 0.6686 0.3109 2.7321 1.9940 0.3082 128.6412 470.3164 0.8160 0.9250 6.3391 5.7911 4.0704 7.3395 1.1054 0.7937 0.0677 0.1665 1.7328 0.6476 0.2854 0.0578 0.1897 0.4779 0.2253 0.1217 14.8857 4.9135 10.9744 5.6435 7.6702 3.1619 6.1228 14.4696 9.1742 1.9290 9.0282 5.0771 5.3613 4.6714 3.2533 31.6122 37.8515 43.9387 42.0729 24.7892 31.2212 44.3738 0.1245 0.0416 0.2254 0.3625 0.3262 1.1492 24.6575 230.5027 5.2035 15.7876 3.5460 9.3584 10.0858 8.4351 251.8036 408.6405 79.2909 145.2575 37.3246 21.0841 658.7758 6.1139 7.5754 2.8638 5.8667 3.9677 11.6738 55.2699 41.6187 6.9663 0.2378 0.3658 0.2805 1.0055 1.1257 1.5857 0.6026 23.3169 6.6356 8.8376 4.7766 21.1395 22.0369 49.2845 56.9036 41.0521 26.9796 12.7893 13.3456 16.3575 10.7551 16.7873 15.6903 74.1693 1.0794 1.5570 0.9178 2.8284 1.4841 3.9920 0.1302 0.2201 0.1130 2.9696 2.9251 3.2478 73.9797 35.4827 59.5495 10.2684 28.2781 63.2821 36.7953 4.2727 23.0104 17.0133 17.3354 3.7782 29.5925 0.7037 0.2757 0.5276 0.5969 3.9012 2.9604 0.4707 5.1755 0.0077 0.8987 0.3008 8.3083 11.1540 4.7755 7.4759 13.3603 13.0088 8.2439 15.0928 12.6360 26.4479 20.5914 25.1619 13.0011 17.6385 13.9027
temp: 298.150 k
press: 1.00000 atm
elementType: 46 6 6 6 6 6 6 1 1 1 1 1 1 1 1 8 16 8 8 6 9 9 9 1 15 6 6 6 6 1 6 1 6 1 1 1 6 6 6 6 1 6 1 6 1 1 1 6 6 6 6 1 6 1 6 1 1 1 15 6 6 6 6 1 6 1 6 1 1 1 6 6 6 6 1 6 1 6 1 1 1 6 6 6 6 1 6 1 6 1 1 1
symmnumber: 1
zpe: 1890164.6 jmol-1
zpe.correction: 0.719926 hartree
zpe.thermalcorrener: 0.769385 hartree
zpe.thermalcorrenthalpy: 0.770329 hartree
zpe.thermalcorrgfe: 0.630912 hartree
zpe.sumelectzpe: -3390.681542 hartree
zpe.sumelectthermal: -3390.632083 hartree
zpe.sumelectthermalent: -3390.631139 hartree
zpe.sumelectthermalfe: -3390.770555 hartree
dipole: -12.5955 1.1896 -4.7886
dipole: 13.5275
quadrupole: -341.1606 -311.1059 -305.9999
quadrupole: -2.6565 -11.7464 0.3588
quadrupole: -21.7385 8.3163 13.4222 -2.6565 -11.7464 0.3588
hfenergy: -3391.4014674 hartree
pointgroup: C01 [X(C43H39F3O3P2Pd1S1)]
dipole: -4.9751381 0.5056019 -1.8213239 debye
polarizability: 826.0572294|-29.4112551|738.3829756|11.0327447|21.3306293|822.6765149 unknown
InChI: InChI=1/43C.3F.3O.2P.Pd.S.39H
charge 0 multiplicity 1
92 atoms
Pd 0.16244064 -0.41454947 -0.64200493
C  1.43835363 -3.17165536 -2.31767371
C  1.49672648 -2.08667517 -1.26618993
C  1.8185105 -0.79302561 -1.61876318
C  2.27589735 -0.34077033 -2.95833103
C  2.62065155 -1.54758596 -3.83374379
C  1.53085495 -2.61108274 -3.73392194
H  1.60780903 -2.401787 -0.22285418
H  2.28523277 -3.86014808 -2.13930364
H  1.47808867 0.26319958 -3.42207431
H  3.13453369 0.33413112 -2.83473906
H  2.75849567 -1.22059501 -4.87596653
H  3.58154817 -1.97669971 -3.50038454
H  0.56395727 -2.16110408 -4.02471415
H  1.71970225 -3.42955464 -4.44551967
O  2.39824036 -1.04797882 1.57024879
S  3.57520557 -0.4469677 0.92516221
O  4.28238706 0.58086259 1.68400154
O  3.3850567 -0.09958481 -0.52066137
C  4.77775445 -1.84929927 0.83009919
F  4.27408392 -2.85420577 0.12249135
F  5.05722623 -2.29130176 2.04945584
F  5.9036489 -1.45116093 0.25346092
H  0.52541462 -3.77720718 -2.19263373
P  -1.9461855 -1.11289386 0.16797129
C  -3.07533243 -0.00184122 1.08558574
C  -3.84340619 0.9414553 0.3885258
C  -3.13364413 -0.02903461 2.48358771
C  -4.66576827 1.82887508 1.07788664
H  -3.8135647 0.97838353 -0.70179843
C  -3.95689632 0.86182559 3.16979388
H  -2.53432595 -0.7508417 3.04212574
C  -4.72741172 1.78921654 2.4708434
H  -5.26289263 2.55445955 0.52033597
H  -3.99120516 0.83120138 4.26111952
H  -5.37231992 2.48572774 3.01175491
C  -1.70330728 -2.50406372 1.33403756
C  -0.4928308 -2.56537073 2.03614911
C  -2.68415116 -3.47732857 1.56118542
C  -0.2720431 -3.58462666 2.9625581
H  0.28721069 -1.82109621 1.85277987
C  -2.45591221 -4.49802081 2.48184047
H  -3.62891586 -3.44543568 1.01398783
C  -1.25130921 -4.55179805 3.18576026
H  0.67564462 -3.62379518 3.50494869
H  -3.22340564 -5.257305 2.64980605
H  -1.07529624 -5.35394268 3.90654589
C  -2.99914529 -1.78866741 -1.16770151
C  -4.38780081 -1.93691995 -1.04732635
C  -2.36792446 -2.19189662 -2.35164246
C  -5.12657048 -2.48807273 -2.09274021
H  -4.8978797 -1.61139266 -0.13770574
C  -3.10819317 -2.74543702 -3.39473709
H  -1.28630874 -2.05999278 -2.4491105
C  -4.48898947 -2.89407503 -3.26609327
H  -6.20860523 -2.59907098 -1.99052701
H  -2.60361633 -3.05440984 -4.31317409
H  -5.07236367 -3.32217285 -4.08471242
P  0.06910599 1.82176423 -0.15451665
C  1.61820104 2.77040096 -0.37582389
C  2.06129908 2.9949452 -1.68734297
C  2.40308975 3.2013197 0.69586186
C  3.27093149 3.64033809 -1.91999644
H  1.45386751 2.66062115 -2.53244161
C  3.6186624 3.84422669 0.4591243
H  2.07424599 3.02991479 1.72230437
C  4.0561588 4.06392798 -0.84461841
H  3.60578987 3.81170962 -2.94591994
H  4.22779491 4.17161642 1.30487256
H  5.00913235 4.56637891 -1.02676231
C  -0.40502551 2.13316467 1.58106103
C  0.24004016 1.35113389 2.55218037
C  -1.35838561 3.07543283 1.9766387
C  -0.04586383 1.53852574 3.9024922
H  0.97463195 0.59848549 2.24945534
C  -1.64623812 3.25064947 3.32955065
H  -1.89518094 3.66528263 1.23230849
C  -0.98697008 2.49113957 4.29426206
H  0.46631942 0.93015484 4.65182761
H  -2.4009006 3.98166054 3.62841346
H  -1.2168894 2.63196387 5.35310778
C  -1.09162838 2.73763937 -1.22472962
C  -1.1910156 4.13557884 -1.17816501
C  -1.85848346 2.02572894 -2.15379123
C  -2.07720813 4.80205502 -2.0207127
H  -0.56450265 4.70684143 -0.4884636
C  -2.74011985 2.69507895 -3.00211235
H  -1.75297199 0.93821316 -2.21239844
C  -2.85646481 4.0823244 -2.92931229
H  -2.15523823 5.89070517 -1.97400524
H  -3.33464359 2.12899229 -3.72282295
H  -3.54786391 4.6087281 -3.59156608
