program: Gaussian 16
title: Title
version: ES64L-G16RevC.01
method: RPBE1PBE
basis: def2SVP
operation: Freq
keyword: #N
keyword: Geom=AllCheck
keyword: Guess=TCheck
keyword: SCRF=Check
keyword: GenChk
keyword: RPBE1PBE/def2SVP
keyword: Freq
converged: YES YES NO YES
title: Mulliken charges:
elementType: Pd C C C C C C H H H H H H H H O S O O C F F F H P C C C C H C H C H H H C C C C H C H C H H H C C C C H C H C H H H P C C C C H C H C H H H C C C C H C H C H H H C C C C H C H C H H H
charge: 0.153901 0.011858 -0.080406 -0.246029 0.041854 -0.067888 -0.066480 0.057857 0.048186 0.065655 0.059469 0.036840 0.041249 0.041382 0.038319 -0.524704 0.909257 -0.549368 -0.555387 0.473665 -0.178609 -0.178342 -0.175657 0.045226 0.382865 -0.170443 -0.018741 -0.002626 -0.023516 0.042811 -0.005160 0.047199 -0.024113 0.039282 0.037502 0.041849 -0.159495 -0.031827 -0.012618 -0.030363 0.064163 -0.023318 0.037669 -0.018213 0.027553 0.042960 0.044582 -0.163082 -0.026085 -0.024276 -0.021717 0.054767 -0.024009 0.071159 -0.020214 0.043664 0.044562 0.046736 0.368059 -0.117909 -0.017444 -0.029152 -0.024898 0.053042 -0.025040 0.030244 -0.019933 0.041829 0.027759 0.042797 -0.121459 -0.037150 -0.021217 -0.018405 0.062668 -0.000476 0.040768 -0.021472 0.030340 0.036515 0.041128 -0.180407 -0.007821 -0.037506 -0.020774 0.055179 -0.017667 0.079126 -0.010611 0.049953 0.047059 0.051519
chargesum: -0.00000
title: Mulliken charges with hydrogens summed into heavy atoms:
elementType: Pd C C C C C C O S O O C F F F P C C C C C C C C C C C C C C C C C C P C C C C C C C C C C C C C C C C C C
charge: 0.153901 0.105271 -0.022549 -0.246029 0.166979 0.010201 0.013221 -0.524704 0.909257 -0.549368 -0.555387 0.473665 -0.178609 -0.178342 -0.175657 0.382865 -0.170443 0.024070 0.044573 0.015766 0.032342 0.017736 -0.159495 0.032336 0.025050 -0.002810 0.019642 0.026369 -0.163082 0.028681 0.046882 0.021947 0.020553 0.026522 0.368059 -0.117909 0.035598 0.001093 0.016931 0.002719 0.022863 -0.121459 0.025518 0.019551 0.011935 0.036039 0.019656 -0.180407 0.047358 0.041620 0.029179 0.029393 0.040908
1716.lowfreq: -5.5622 0.0009 0.0009 0.0012 2.8094 7.4437 13.7443 14.5102 19.6727
redmass: 5.1912 9.2742 8.5171 6.4368 7.2734 5.4446 5.0624 6.0027 5.1746 5.5706 5.6864 4.9045 6.6696 6.9023 5.3977 6.1160 4.5980 5.4694 5.1767 6.9570 5.4794 5.1362 5.1843 5.6254 5.3255 5.2433 5.5971 5.0650 4.0196 3.4115 4.8135 4.9407 16.5228 7.8903 4.4738 6.1931 4.6642 5.1917 4.8954 5.4206 4.7571 4.0440 4.7845 4.9906 5.4903 5.4178 4.9583 4.7930 4.9076 1.8077 17.5936 17.4731 17.4149 2.8316 2.8787 2.8743 2.9097 2.9359 3.0046 2.5199 6.3874 6.1879 5.3333 5.8072 5.7392 4.6266 2.6366 7.2725 13.3691 16.1021 4.9079 4.6939 4.2081 4.6066 3.8179 5.3139 18.0436 18.0718 11.7566 6.3589 6.3798 6.3966 6.5116 6.3784 7.8730 6.3718 6.1575 1.7102 2.8935 4.8096 1.8631 3.0544 3.1182 1.9823 1.8589 2.4766 1.9155 6.2150 1.6630 1.9249 1.7887 1.7691 1.9456 16.3154 1.8879 1.3004 1.4106 3.0458 1.2618 1.2495 1.2408 1.2522 1.2396 1.2480 2.1879 1.3709 1.3654 2.6421 1.3506 1.3490 1.3468 1.3355 1.3362 1.4065 3.1832 3.4281 4.1383 2.3221 4.2955 3.3120 5.3492 1.4444 5.0064 1.4569 1.4202 1.4178 10.2848 1.3339 1.3410 1.3372 1.3386 1.3594 1.5083 1.6030 2.3664 2.3694 2.4762 2.4352 2.2461 2.3636 1.8175 1.3447 1.4783 1.4915 1.4957 1.5124 1.5378 1.7258 2.9480 2.8601 2.9973 2.7559 3.0100 1.3596 1.7731 1.0650 1.0635 1.0686 1.0711 1.0666 1.0728 1.4256 1.1432 1.1464 1.1422 1.1344 1.1366 9.5862 1.1930 10.2208 3.5399 1.8310 13.3954 1.1774 9.8302 1.2756 1.3795 1.3705 1.3566 1.3515 1.3611 1.6239 1.7768 1.5983 1.5508 1.6737 6.1668 6.5919 4.7198 6.1481 5.6749 5.5717 1.0996 1.0899 1.0989 1.1207 2.3899 2.3965 2.4185 2.3739 2.4260 2.4410 2.2968 2.2910 2.2921 2.2993 2.2343 2.0680 6.1318 6.1232 6.0704 6.1090 6.2816 6.2577 6.2392 6.2861 6.3011 6.1244 6.0853 6.1352 7.7267 1.0672 1.0661 1.0669 1.0634 1.0969 1.0978 1.1011 1.1058 1.0913 1.0943 1.0916 1.0887 1.0881 1.0863 1.0867 1.0880 1.0888 1.0877 1.0904 1.0932 1.0896 1.0912 1.0907 1.0919 1.0927 1.0935 1.0963 1.0969 1.0951 1.0960 1.0977 1.0964 1.0980 1.1009 1.1001 1.0988 1.1008 1.0965 1.0956
irintensity: 0.6356 0.1271 1.5692 0.1630 0.4708 0.5438 0.5186 1.9998 1.1692 0.6723 1.7509 0.6882 2.5128 3.3683 4.2703 2.7957 0.9254 0.2947 0.3145 5.8126 0.1079 1.1003 1.2685 3.7968 5.7801 0.6428 0.5470 0.4730 1.0996 0.0563 0.4032 1.8408 6.9509 6.2118 3.2130 2.7693 10.3722 3.5509 1.9137 4.8761 1.4430 2.4527 1.1302 1.3765 0.8357 1.5820 2.9478 1.2937 1.5261 4.6892 5.0902 2.4638 0.2365 0.0447 0.1944 0.3867 0.4260 0.3590 2.0560 15.5498 25.8480 19.4085 9.7846 18.2268 13.8889 22.3974 2.3623 100.2976 32.5492 34.2063 49.0041 66.0328 137.2385 188.6185 13.7004 121.5501 9.0528 6.8118 255.5032 1.7598 0.7184 8.0550 10.5782 0.6160 79.7968 18.5501 7.1141 114.7622 75.9023 33.9723 63.7643 57.7615 24.9740 34.9213 71.6886 7.8881 9.6399 12.6998 12.2561 27.7197 16.3303 10.1650 20.9760 3.6908 11.6254 27.6010 16.4981 0.5525 1.9645 1.8683 1.3884 1.1258 1.2132 1.8572 3.9698 20.5157 3.0258 1.0934 4.6583 1.3008 2.8255 0.7555 2.6643 2.0013 23.7813 48.5557 2.0202 10.0531 10.8294 39.1809 2.4954 0.4659 1.3201 2.9801 4.9260 4.6205 304.2145 0.3461 1.8350 0.0860 0.3131 3.6730 3.9949 12.0354 5.5084 0.1674 6.5104 5.9288 3.3649 3.8534 0.7884 3.1987 4.6051 11.4340 7.3493 7.9088 6.9798 13.3477 41.8858 16.9523 37.6052 67.1381 75.0661 15.8932 19.5963 2.2605 0.1510 0.1462 5.2762 0.1843 0.1670 16.1662 9.1578 33.8863 19.5890 7.9232 6.8045 218.8282 17.0367 42.0389 495.9390 239.7407 291.6693 8.1719 524.8438 30.7050 23.6447 4.3113 0.4071 20.7486 10.1246 37.8338 50.6287 11.0665 3.2669 1.0971 1.5830 0.9058 0.9921 1.2111 0.4780 0.1172 0.9321 24.9798 7.8638 2.2416 12.1512 54.4944 12.5327 78.2719 35.6418 65.2163 9.9009 14.2653 4.2743 17.4989 15.4462 20.6384 1.1723 1.0373 0.3505 2.4317 5.1652 1.4965 1.6341 0.8403 0.9830 1.4481 2.2849 0.8967 26.9612 45.3194 24.2038 48.0114 38.8832 55.8794 17.3242 64.1850 54.4607 38.2718 72.0866 2.9370 4.0570 2.4948 0.0639 0.1415 3.9163 0.8385 0.1322 21.2892 54.5258 5.5585 0.5047 3.6881 4.1772 4.7202 8.2146 10.2266 5.1104 14.7337 10.0662 14.2545 5.2845 12.7130 18.1120 14.0973 15.9109 12.1217 10.5336 18.4679
temp: 298.150 k
press: 1.00000 atm
elementType: 46 6 6 6 6 6 6 1 1 1 1 1 1 1 1 8 16 8 8 6 9 9 9 1 15 6 6 6 6 1 6 1 6 1 1 1 6 6 6 6 1 6 1 6 1 1 1 6 6 6 6 1 6 1 6 1 1 1 15 6 6 6 6 1 6 1 6 1 1 1 6 6 6 6 1 6 1 6 1 1 1 6 6 6 6 1 6 1 6 1 1 1
symmnumber: 1
zpe: 1894684.7 jmol-1
zpe.correction: 0.721647 hartree
zpe.thermalcorrener: 0.772011 hartree
zpe.thermalcorrenthalpy: 0.772955 hartree
zpe.thermalcorrgfe: 0.630087 hartree
zpe.sumelectzpe: -3390.704124 hartree
zpe.sumelectthermal: -3390.653760 hartree
zpe.sumelectthermalent: -3390.652815 hartree
zpe.sumelectthermalfe: -3390.795684 hartree
dipole: 20.9199 5.8050 0.7272
dipole: 21.7225
quadrupole: -364.5313 -300.0244 -314.3777
quadrupole: -10.2461 -5.7700 -0.7978
quadrupole: -38.2201 26.2867 11.9334 -10.2461 -5.7700 -0.7978
hfenergy: -3391.4257709 hartree
pointgroup: C01 [X(C43H39F3O3P2Pd1S1)]
dipole: -7.5807772 2.0654138 -3.3622829 debye
polarizability: 837.4222389|-37.497092|719.1305245|-3.9001656|-20.2300092|802.3338406 unknown
InChI: InChI=1/43C.3F.3O.2P.Pd.S.39H
charge 0 multiplicity 1
92 atoms
Pd -0.32284252 -0.59414803 -1.11496967
C  3.46333102 -0.9810445 -3.0435563
C  2.35388499 -0.75124481 -2.05364585
C  1.14384188 -0.30623271 -2.41975823
C  0.78868333 0.13027592 -3.81193565
C  2.03554742 0.25597275 -4.69128577
C  2.97660981 -0.92338208 -4.48583951
H  2.57775713 -0.94114502 -0.9973513
H  4.24163306 -0.21380467 -2.86783095
H  0.07056354 -0.58239657 -4.25729055
H  0.25532592 1.09510864 -3.77979737
H  1.73926888 0.34705271 -5.74820901
H  2.56427896 1.1877178 -4.42488722
H  2.4424307 -1.8590117 -4.72964832
H  3.83329008 -0.86265757 -5.17547672
O  2.30036598 -1.47492247 1.19981881
S  3.58343751 -1.1011351 1.83610459
O  3.50998544 0.05738896 2.74176695
O  4.74481633 -1.1377363 0.93829671
C  3.87787831 -2.51066383 2.99569746
F  3.90998257 -3.66558405 2.33898943
F  2.90441379 -2.57860426 3.90510971
F  5.03173297 -2.36123159 3.63718861
H  3.95499139 -1.94564498 -2.83122046
P  -2.23435365 -1.26875395 0.21937443
C  -3.25978464 0.0216576 1.00440844
C  -3.8621819 0.98560762 0.18291717
C  -3.42432017 0.10386324 2.38992024
C  -4.6278298 2.00573457 0.73848485
H  -3.74400841 0.9347733 -0.90093608
C  -4.19266771 1.12820331 2.94309683
H  -2.94803827 -0.62903512 3.04345766
C  -4.79726813 2.0774064 2.12225739
H  -5.09267866 2.7486256 0.0860228
H  -4.31075431 1.18577564 4.02750505
H  -5.39649363 2.87905816 2.56022304
C  -1.90185769 -2.47175861 1.55219047
C  -0.59019084 -2.63973245 2.0087109
C  -2.93881759 -3.22284546 2.12464081
C  -0.32135598 -3.53973666 3.04166539
H  0.23514688 -2.07731463 1.56522428
C  -2.66504278 -4.12003032 3.15302683
H  -3.9643618 -3.10634589 1.7647461
C  -1.355622 -4.27697246 3.61479713
H  0.70515437 -3.65870543 3.39415066
H  -3.47668427 -4.70163806 3.596389
H  -1.1433746 -4.98184637 4.42236724
C  -3.40868519 -2.16599255 -0.86629935
C  -4.79854638 -2.02978218 -0.76703905
C  -2.87293436 -3.04681604 -1.81800246
C  -5.63781662 -2.76129165 -1.60715326
H  -5.23084151 -1.34755267 -0.03203415
C  -3.71464739 -3.77882665 -2.65254639
H  -1.78979685 -3.1769651 -1.90770143
C  -5.09903313 -3.63515074 -2.55046787
H  -6.72088989 -2.64672243 -1.52084705
H  -3.28599967 -4.46251755 -3.38888023
H  -5.75861827 -4.20560642 -3.20854971
P  0.0118797 1.53841928 -0.55450984
C  1.69434276 2.22205246 -0.75851101
C  2.0422536 2.89146156 -1.93933761
C  2.67907145 1.95594999 0.19775467
C  3.36122385 3.28297559 -2.15741812
H  1.28665947 3.10372033 -2.6983516
C  3.99940211 2.33531315 -0.03308311
H  2.44466434 1.43007034 1.12314541
C  4.34521103 2.99925896 -1.20915777
H  3.62158224 3.80702696 -3.08002794
H  4.75664808 2.0899434 0.71436549
H  5.38107602 3.2962733 -1.38925826
C  -0.37477755 1.75887017 1.21539637
C  0.20682168 0.85663922 2.11723912
C  -1.20333221 2.77979754 1.6930052
C  -0.00897013 1.00160097 3.48512729
H  0.84617942 0.04457472 1.76090072
C  -1.42072164 2.91171653 3.06311353
H  -1.69665448 3.46546419 1.00334746
C  -0.81913488 2.03138712 3.96158631
H  0.46564169 0.30020012 4.17515349
H  -2.07657527 3.70524607 3.42759855
H  -0.99409004 2.14112768 5.03445499
C  -1.04967002 2.66660402 -1.50569601
C  -0.95223205 4.05582517 -1.33463632
C  -1.96702685 2.1479873 -2.42597601
C  -1.78743398 4.90634054 -2.05386727
H  -0.21688007 4.47611062 -0.64438037
C  -2.79803901 3.00272991 -3.14840929
H  -2.02198773 1.06596563 -2.57751118
C  -2.71340948 4.38089441 -2.95713289
H  -1.71146754 5.98652916 -1.91158479
H  -3.51119731 2.58840624 -3.86420763
H  -3.36516484 5.05179277 -3.52149562
