program: Gaussian 16
title: Title
version: ES64L-G16RevC.01
method: RPBE1PBE
basis: def2SVP
operation: Freq
keyword: #N
keyword: Geom=AllCheck
keyword: Guess=TCheck
keyword: SCRF=Check
keyword: GenChk
keyword: RPBE1PBE/def2SVP
keyword: Freq
converged: YES YES YES YES
title: Mulliken charges:
elementType: Pd C C C C C C H H H H H H H H O S O O C F F F H P C C C C H C H C H H H C C C C H C H C H H H C C C C H C H C H H H P C C C C H C H C H H H C C C C H C H C H H H C C C C H C H C H H H
charge: -0.087854 0.057414 -0.190546 -0.058111 0.060700 -0.062358 -0.102855 0.055605 0.033636 0.074316 0.046790 0.037163 0.037710 0.070345 0.038839 -0.432349 0.927765 -0.448077 -0.459668 0.527649 -0.141676 -0.147304 -0.144900 0.056154 0.325969 -0.132030 -0.031203 -0.013446 -0.034345 0.039145 -0.009665 0.032237 -0.016823 0.032003 0.029904 0.033579 -0.139166 -0.045170 -0.028062 -0.025234 0.075484 -0.025185 0.031899 -0.024077 0.035682 0.038151 0.041429 -0.183767 -0.022555 -0.009916 -0.023378 0.051043 -0.016187 0.036963 -0.022557 0.042226 0.038894 0.044999 0.339526 -0.131763 -0.018984 -0.028279 -0.035833 0.047347 -0.030050 0.029286 -0.030405 0.036417 0.033890 0.037921 -0.118176 -0.042990 -0.020637 -0.017344 0.040548 -0.010186 0.028207 -0.028140 0.031809 0.032036 0.036606 -0.178568 -0.013757 -0.037766 -0.026680 0.045707 -0.013335 0.065913 -0.022300 0.042453 0.037514 0.044783
chargesum: -0.00000
title: Mulliken charges with hydrogens summed into heavy atoms:
elementType: Pd C C C C C C O S O O C F F F P C C C C C C C C C C C C C C C C C C P C C C C C C C C C C C C C C C C C C
charge: -0.087854 0.147205 -0.134940 -0.058111 0.181806 0.012515 0.006328 -0.432349 0.927765 -0.448077 -0.459668 0.527649 -0.141676 -0.147304 -0.144900 0.325969 -0.132030 0.007942 0.018791 -0.002341 0.020239 0.016756 -0.139166 0.030313 0.003837 0.010448 0.012966 0.017352 -0.183767 0.028488 0.027047 0.018847 0.022707 0.022442 0.339526 -0.131763 0.028363 0.001006 0.000584 0.003840 0.007516 -0.118176 -0.002443 0.007570 0.014466 0.021850 0.008466 -0.178568 0.031950 0.028147 0.015773 0.024179 0.022483
1716.lowfreq: -6.3734 -4.4618 -3.0915 -0.0007 -0.0003 0.0003 7.8349 18.4306 23.1595
redmass: 6.6654 5.6231 8.2702 7.7546 6.2524 5.9821 6.2406 5.2369 6.3865 4.8512 5.5773 5.0178 5.1561 5.6784 4.3427 4.8441 5.0944 5.5900 5.0618 5.5401 4.4335 5.1632 5.1325 4.7701 5.0321 4.2378 10.4139 4.0080 5.6268 6.4061 7.2869 10.7790 4.8906 6.3328 4.7520 4.6268 4.7209 4.8215 5.7218 5.6515 4.9331 5.0407 5.2311 5.2086 5.7566 4.8430 4.9238 10.4677 9.1226 2.3588 5.0047 10.2995 3.6602 3.0474 2.8829 2.8773 2.8719 2.9003 2.9351 6.6297 6.6717 7.0244 5.2797 3.0006 5.8869 5.5956 4.3944 4.8624 5.0125 4.4698 4.8718 6.6975 4.1492 4.5503 11.9361 13.9178 5.2379 10.9094 6.3743 6.3697 6.3496 6.3774 6.3607 6.3550 3.4500 6.2934 6.2981 4.4637 3.6315 2.0332 1.7271 4.4976 2.0053 1.8494 3.7605 1.6828 1.8249 3.3268 1.9187 1.8751 1.9056 1.8920 2.0321 2.0177 14.1321 1.3135 3.7217 1.2520 1.3440 1.2696 1.2511 1.2460 1.2582 1.2389 2.3805 1.9012 1.3820 1.3719 3.6617 1.9420 1.3927 1.3620 1.3826 1.3463 1.3998 1.3832 3.1678 4.5659 2.6702 5.1757 4.8838 2.1668 2.2491 5.4201 2.3757 1.3988 1.3832 1.3311 1.3254 1.3349 1.3347 1.3324 1.3358 2.3363 2.3976 2.4975 2.5144 2.5177 2.5151 1.6148 1.4340 1.4496 1.4572 1.4990 1.4923 1.4950 1.4895 1.5124 2.9160 2.9351 2.9577 2.9200 2.9102 2.8520 1.8154 2.5826 1.0694 1.0721 1.0638 1.0631 1.0672 1.0697 1.1173 1.1133 1.1139 1.1136 1.5973 1.1119 1.1121 7.1916 1.3523 11.2870 13.1087 1.2364 1.4423 1.3788 1.3835 1.3708 1.3675 1.3588 1.3625 1.5619 1.8165 1.7644 1.7107 6.0480 6.1501 9.1408 6.6060 6.3746 7.3866 7.0536 1.1398 1.0809 1.1176 1.1244 2.3836 2.3901 2.4104 2.3996 2.4302 2.4441 3.9363 2.3502 2.3306 2.2712 2.2921 2.2793 2.2894 6.1719 6.1699 6.2242 6.2246 6.3221 6.3200 6.2907 6.2884 6.3946 6.3463 6.3209 6.3100 1.0703 1.0668 1.0642 1.0635 1.0952 1.0995 1.1026 1.1049 1.0889 1.0880 1.0861 1.0860 1.0865 1.0869 1.0883 1.0884 1.0886 1.0890 1.0891 1.0895 1.0897 1.0918 1.0933 1.0926 1.0938 1.0938 1.0942 1.0963 1.0966 1.0952 1.0957 1.0978 1.0962 1.1005 1.1004 1.1008 1.0996 1.1008 1.0969
irintensity: 0.1324 0.3406 0.2315 0.0965 0.0641 0.6201 0.7077 0.2373 0.1072 0.0922 0.2538 0.3133 0.3255 1.0170 0.0964 0.3929 0.7362 0.2117 0.4110 0.5026 0.8132 0.5034 2.1388 1.1228 0.2420 0.8239 0.6820 1.3504 0.7362 0.9995 3.6757 3.0497 0.3036 7.4182 0.3210 3.1272 6.4858 3.0087 3.1768 7.2725 1.9840 1.9816 0.5792 0.1937 7.5447 1.4657 0.4891 5.9063 2.3524 0.3198 7.3240 9.6597 100.6791 31.1702 5.5220 1.7594 1.0264 2.4182 0.1399 64.8926 1.7892 11.2446 9.8736 8.4296 10.5632 32.7580 49.9518 26.7857 112.6081 144.9766 73.1468 38.9452 150.8926 78.2007 7.2707 38.9884 194.3210 100.2968 0.3325 2.0823 0.5219 1.7206 3.5566 1.0504 55.7577 14.8922 3.2859 26.6187 73.5580 87.5927 45.3796 16.4955 51.0677 65.7810 26.6997 27.1187 26.9945 27.6469 16.0768 20.7417 4.7134 10.7993 14.9326 15.2549 16.2199 9.0630 156.1401 1.3570 37.5678 18.2388 0.5591 0.7685 10.7726 0.2133 211.5479 122.6433 1.4288 2.1898 299.3772 55.2224 10.1053 0.8357 4.3483 0.5578 2.0574 0.6702 101.2393 2.6743 0.7635 4.4839 4.6242 8.8013 3.0272 0.3487 1.5418 0.6981 3.3911 0.1352 0.2881 0.5857 0.9788 0.6831 0.2427 8.6990 8.9017 7.3776 10.6425 1.7197 8.5430 9.7769 22.7057 7.5279 15.3602 0.7345 4.5617 4.5369 4.8477 5.6804 15.8755 38.3566 33.5499 58.8239 18.1007 22.7505 65.8019 300.2310 1.0614 0.0775 0.0057 0.0534 0.8514 0.3187 3.6461 8.9900 4.9972 4.4553 0.3784 1.3160 4.5558 76.2193 24.6148 411.4545 321.2362 3.8418 8.2942 7.6189 5.2749 7.4776 11.2940 7.3878 11.8320 22.7670 27.1805 56.0786 5.4865 23.8187 48.3637 324.6363 22.8503 14.3431 6.9323 2.1831 12.3733 14.2604 7.4840 3.4046 26.4152 21.5643 25.9189 39.0334 50.3820 34.9839 55.1726 4.1535 21.8131 27.8415 13.0850 17.1252 23.2970 0.8577 0.7003 0.9542 2.2898 1.2190 2.9098 1.0583 16.7723 0.6292 1.3489 5.4038 6.7312 102.0324 27.7550 71.7008 26.6204 44.6024 85.1787 39.3672 30.0914 3.8040 1.1271 1.0998 2.0960 6.3289 1.7088 0.8411 0.1251 3.2116 0.8422 3.8263 16.3975 21.0170 1.7152 12.5449 0.0885 1.4156 8.6662 0.7206 13.5637 12.4385 8.8574 5.5838 6.7331 31.2208 26.1629 32.5611 16.3157 14.8845 22.0859 18.2568
temp: 298.150 k
press: 1.00000 atm
elementType: 46 6 6 6 6 6 6 1 1 1 1 1 1 1 1 8 16 8 8 6 9 9 9 1 15 6 6 6 6 1 6 1 6 1 1 1 6 6 6 6 1 6 1 6 1 1 1 6 6 6 6 1 6 1 6 1 1 1 15 6 6 6 6 1 6 1 6 1 1 1 6 6 6 6 1 6 1 6 1 1 1 6 6 6 6 1 6 1 6 1 1 1
symmnumber: 1
zpe: 1895069.1 jmol-1
zpe.correction: 0.721794 hartree
zpe.thermalcorrener: 0.771510 hartree
zpe.thermalcorrenthalpy: 0.772455 hartree
zpe.thermalcorrgfe: 0.630941 hartree
zpe.sumelectzpe: -3390.695704 hartree
zpe.sumelectthermal: -3390.645988 hartree
zpe.sumelectthermalent: -3390.645043 hartree
zpe.sumelectthermalfe: -3390.786557 hartree
dipole: 6.2909 0.6053 2.4886
dipole: 6.7923
quadrupole: -323.3277 -318.2693 -314.0402
quadrupole: 7.8361 0.4823 2.0666
quadrupole: -4.7820 0.2764 4.5055 7.8361 0.4823 2.0666
hfenergy: -3391.417498 hartree
pointgroup: C01 [X(C43H39F3O3P2Pd1S1)]
dipole: -2.3226284 0.1029105 -1.3175596 debye
polarizability: 801.2781594|-10.4136401|740.9388849|35.7550434|0.8497936|814.5726402 unknown
InChI: InChI=1/43C.3F.3O.2P.Pd.S.39H
charge 0 multiplicity 1
92 atoms
Pd 0.32236662 -0.43405959 -0.51714435
C  1.4137681 -2.97031605 -2.02207686
C  1.67319587 -2.04429359 -0.85379573
C  2.30561959 -0.79222192 -1.05563439
C  2.75958243 -0.3087775 -2.42024726
C  2.76784821 -1.43333871 -3.45087126
C  1.49602472 -2.2650535 -3.36887153
H  1.80967947 -2.5452029 0.10751562
H  2.17510958 -3.77447296 -2.00353404
H  2.1157441 0.51496665 -2.76537485
H  3.76720874 0.12117401 -2.31517057
H  2.89698794 -1.00721339 -4.4580195
H  3.63617413 -2.09163421 -3.270244
H  0.62506059 -1.59818716 -3.50446791
H  1.45839361 -3.00463254 -4.18403444
O  2.24377316 -1.14101327 2.04458448
S  3.42903721 -0.56101269 1.43956676
O  4.07910013 0.58289277 2.03893739
O  3.28811197 -0.26483993 -0.09633591
C  4.71116981 -1.90366809 1.3973472
F  4.26381824 -2.94588376 0.72181416
F  4.97528317 -2.26435263 2.63884294
F  5.80583458 -1.44497872 0.82497221
H  0.44129653 -3.47479041 -1.90065573
P  -1.77422058 -1.30499366 0.06811695
C  -2.85120248 -0.24690452 1.11457447
C  -3.69538954 0.70464776 0.52475551
C  -2.74651381 -0.2828815 2.51014995
C  -4.43185619 1.58450537 1.31410249
H  -3.7877896 0.75945252 -0.5611452
C  -3.47901728 0.60342629 3.29730945
H  -2.08579976 -1.00834235 2.99031905
C  -4.32682749 1.53678567 2.70348871
H  -5.08879101 2.3156003 0.8363893
H  -3.38069393 0.56576457 4.38466465
H  -4.89858445 2.2318834 3.32276811
C  -1.63741681 -2.84370428 1.06446746
C  -0.52189043 -2.96206589 1.90501569
C  -2.574097 -3.88343603 1.02310093
C  -0.35852165 -4.09079407 2.70699561
H  0.23000519 -2.16893365 1.9190881
C  -2.40003955 -5.01819581 1.81492084
H  -3.44177209 -3.81739538 0.36370126
C  -1.29597303 -5.12281512 2.6616979
H  0.51378973 -4.16740463 3.36078029
H  -3.13348391 -5.82693939 1.76848532
H  -1.16309056 -6.01322293 3.28102394
C  -2.87864831 -1.76761232 -1.31916366
C  -4.2629063 -1.94353255 -1.17908551
C  -2.29351085 -1.96048132 -2.57613142
C  -5.03966845 -2.30955903 -2.27647141
H  -4.74025873 -1.78211252 -0.20977549
C  -3.07028201 -2.32796693 -3.67415798
H  -1.21720625 -1.80786115 -2.68682699
C  -4.44553415 -2.5026083 -3.52510637
H  -6.11751861 -2.44236234 -2.15654292
H  -2.59881335 -2.47126831 -4.64923681
H  -5.05870408 -2.78491025 -4.38426733
P  0.05648111 1.86211252 -0.2607679
C  1.57546861 2.84912631 -0.57305833
C  1.91116924 3.17194721 -1.89681583
C  2.48030677 3.1597619 0.44813992
C  3.12363323 3.79158963 -2.18950185
H  1.21559074 2.93991552 -2.70771711
C  3.69559363 3.77629717 0.15219007
H  2.24501576 2.91020372 1.48441442
C  4.02304106 4.09328457 -1.1654047
H  3.3680448 4.03907929 -3.22552635
H  4.39208859 4.00795746 0.96170929
H  4.97568415 4.57649159 -1.39506091
C  -0.40363787 2.33380308 1.45130309
C  0.22235912 1.62176443 2.48589059
C  -1.32066442 3.33754142 1.77863362
C  -0.02462336 1.94386865 3.8182596
H  0.90383633 0.8024752 2.24602365
C  -1.57966971 3.64535746 3.11381955
H  -1.84970179 3.87831271 0.99251781
C  -0.92444068 2.96080221 4.13586776
H  0.4797743 1.38582729 4.61087952
H  -2.30536399 4.42587103 3.3548609
H  -1.12801802 3.2084703 5.18046346
C  -1.14747734 2.68246657 -1.36882576
C  -1.27131463 4.07685378 -1.45782416
C  -1.94215337 1.87531541 -2.19015173
C  -2.20168298 4.64548475 -2.324684
H  -0.62745016 4.72282783 -0.85562492
C  -2.8708343 2.44405231 -3.06178293
H  -1.82099156 0.7897288 -2.14590692
C  -3.00684719 3.82996836 -3.12345395
H  -2.29571487 5.73249379 -2.38258155
H  -3.48500817 1.7997638 -3.69548633
H  -3.73369634 4.27959844 -3.80423421
