program: Gaussian 16
title: Title
version: ES64L-G16RevA.03
method: RPBE1PBE
basis: def2SVP
operation: Freq
keyword: #N
keyword: Geom=AllCheck
keyword: Guess=TCheck
keyword: SCRF=Check
keyword: GenChk
keyword: RPBE1PBE/def2SVP
keyword: Freq
converged: YES YES NO YES
title: Mulliken charges:
elementType: Pd P C C C C H C H C H H H C C C C H C H C H H H C C C C H C H C H H H P C C C C H C H C H H H C C C C H C H C H H H C C C C H C H C H H H C C C C C H H H H H N C O O C C C C H C H C H H H C H H H C C C C C C H H H H H H H H H
charge: -0.054118 0.334645 -0.150152 -0.026774 -0.008809 -0.012812 0.070199 -0.022551 0.051195 -0.017429 0.043105 0.046328 0.048435 -0.165316 0.006308 -0.043137 -0.015838 0.043189 -0.016193 0.057392 -0.017349 0.042298 0.046224 0.048707 -0.148243 -0.007394 -0.025129 -0.019808 0.047721 -0.012640 0.059715 -0.015254 0.048422 0.046284 0.050330 0.419450 -0.142566 -0.018972 -0.065706 -0.017522 0.053443 -0.028126 0.086678 -0.010596 0.044341 0.048891 0.045436 -0.161342 -0.030416 -0.002938 -0.030255 0.037123 -0.016200 0.049815 -0.018863 0.043878 0.041913 0.045995 -0.197713 -0.010748 -0.010261 -0.019114 0.053759 -0.010359 0.036592 -0.013601 0.048428 0.043693 0.050590 0.019059 0.118202 0.001748 -0.084621 -0.074390 0.083174 0.082578 0.073880 0.116595 0.108168 -0.336249 0.405803 -0.329058 -0.296675 0.162037 -0.024005 -0.031754 -0.039765 0.038622 -0.043221 0.039329 -0.017131 0.047307 0.046837 0.043321 0.018883 0.062127 0.062639 0.062515 0.032525 -0.059526 -0.345561 0.001513 -0.053922 -0.058374 0.068841 0.054397 0.062958 0.106693 0.043243 0.046681 0.042355 0.041422 0.044519
chargesum: 1.00000
title: Mulliken charges with hydrogens summed into heavy atoms:
elementType: Pd P C C C C C C C C C C C C C C C C C C P C C C C C C C C C C C C C C C C C C C C C C C N C O O C C C C C C C C C C C C C
charge: -0.054118 0.334645 -0.150152 0.043425 0.042386 0.030292 0.023778 0.031006 -0.165316 0.049497 0.014254 0.026461 0.030031 0.031358 -0.148243 0.040327 0.034585 0.028614 0.033644 0.035076 0.419450 -0.142566 0.034470 0.020972 0.026820 0.020765 0.034840 -0.161342 0.006707 0.046877 0.013622 0.025713 0.027132 -0.197713 0.043011 0.026331 0.029314 0.033334 0.036989 0.102233 0.200780 0.075628 0.031975 0.033778 -0.336249 0.405803 -0.329058 -0.296675 0.162037 0.014617 0.007574 0.007543 0.003617 0.026190 0.206164 0.131442 0.009316 -0.345561 0.171163 0.036003 0.025403
1716.lowfreq: -257.4219 -8.5484 -1.5467 0.0003 0.0006 0.0007 4.0548 10.7472 17.0695
redmass: 6.7213 5.6441 5.5459 5.2976 5.3723 5.0398 5.0982 5.2996 4.3087 4.9039 5.0074 4.6115 5.1275 4.7134 5.5682 5.6142 5.3639 5.0210 5.1910 5.2809 5.0544 4.2986 5.6212 5.2551 4.4700 3.9000 5.8481 3.9935 4.3394 4.1385 4.1656 6.9392 4.9157 5.4734 3.3992 4.5769 4.9540 4.0688 4.6379 4.6887 4.5977 3.9230 4.3711 4.4168 5.2012 6.5037 1.7051 1.8821 4.3970 5.3037 4.8446 4.7587 4.9632 4.4772 4.8941 2.0275 3.7695 3.8058 6.2075 2.8242 2.8660 2.8868 2.8864 2.9933 2.9911 4.1700 2.9481 3.6171 5.8526 5.1317 5.4617 6.3408 3.5828 4.8546 3.2617 4.5648 4.7243 4.8952 4.1909 4.5463 3.7860 4.1499 4.1258 4.0888 4.6906 7.2899 5.5780 5.5858 6.3598 6.3513 6.3633 6.3613 6.3774 6.3640 4.9583 4.5256 2.1345 6.3153 6.2583 3.3058 2.0983 1.9166 2.4185 1.9331 3.5026 1.8173 1.9895 3.5235 2.6068 2.9028 1.8065 2.0959 1.7612 1.8960 1.8248 1.9091 2.0162 1.7895 2.3741 1.3404 3.8337 1.4471 1.2504 3.1570 1.3303 3.5296 1.2551 1.2542 1.2466 1.2427 1.3312 2.4897 1.3039 2.1868 1.8394 1.9298 1.5697 1.3603 1.5499 1.3581 1.3499 1.3514 1.3305 1.3287 1.3167 1.8070 2.9846 1.3644 1.4130 1.8109 1.7796 2.8485 2.7940 2.8038 3.6306 1.7069 4.4041 3.5349 4.9548 2.1129 1.5559 1.3226 1.7903 1.3173 1.3321 1.3322 1.3344 1.3415 1.3357 2.0701 2.3211 2.3700 2.0945 1.9293 2.3882 2.5599 2.5796 1.6661 1.7593 1.6082 1.3343 1.3656 1.4689 1.4833 1.4864 1.4996 1.4882 1.5155 1.9138 2.8016 2.8895 2.2632 2.9088 2.9567 2.8838 3.0903 1.1772 1.0964 1.2405 1.0655 1.0691 1.0658 1.0666 1.0719 1.0771 1.1535 1.2727 1.1367 1.1174 1.1223 1.2955 1.1946 1.1449 1.1168 1.2982 4.1241 1.1986 1.2599 1.3757 1.3806 1.8980 1.4730 1.3572 1.4027 1.5688 1.3379 1.3542 1.6113 1.2856 1.5782 1.6211 1.4501 1.6661 4.7250 2.1364 5.7285 5.9453 6.7602 7.3124 7.4442 6.2188 4.0573 1.0991 1.0891 1.1491 1.1275 1.1258 1.1214 1.7641 2.3592 2.3808 2.3942 2.4021 2.4282 2.4428 4.5973 2.5898 2.3050 2.2543 2.3303 2.2997 2.2780 2.2591 2.7292 6.0745 6.1103 6.1652 6.2740 6.3738 6.3117 6.2878 6.3200 6.2932 6.2664 6.2980 6.3697 6.8495 6.4552 6.4952 7.6448 12.6219 1.0673 1.0649 1.0669 1.0643 1.0360 1.0970 1.0968 1.1013 1.1059 1.0963 1.1047 1.0963 1.0913 1.0888 1.0896 1.0864 1.0874 1.0868 1.0882 1.0872 1.0877 1.0870 1.0893 1.0890 1.0905 1.0903 1.0916 1.0917 1.0917 1.0911 1.0932 1.0930 1.0940 1.0948 1.0964 1.0966 1.0954 1.0961 1.0955 1.0977 1.0988 1.1010 1.1010 1.1003 1.0988 1.0999 1.0964 1.0943 1.0934 1.0907 1.0957 1.0976
irintensity: 26.8426 0.0503 0.1251 0.0848 0.0058 0.1590 0.0804 0.0507 0.0658 0.0302 0.0557 0.0435 0.0912 0.7052 0.9117 0.0897 0.3700 0.9448 0.1989 0.3673 0.3531 0.0749 1.4514 1.9560 1.5701 0.5548 1.2878 0.5533 0.1285 1.2892 0.3715 3.0107 0.5997 2.4387 0.3141 1.7057 3.4292 1.7310 4.1303 0.3276 2.2920 1.9187 0.3323 1.9149 1.7930 1.6051 0.4653 0.7948 2.1751 3.6635 0.5700 3.7799 2.2177 1.5387 3.5617 0.6274 2.6233 7.0036 24.5314 0.6325 0.1821 0.2308 0.1222 0.9056 4.0777 29.3179 1.5007 12.4986 16.5962 3.0191 14.0798 16.7454 14.7133 25.8413 5.9137 34.0585 43.9981 98.5373 7.3187 105.8058 27.2184 83.5613 68.7786 84.2622 131.4537 22.7310 1.7737 20.5384 1.0471 0.5427 0.4385 1.7760 1.6535 0.7514 2.8735 9.9775 28.5722 10.1680 12.5426 98.9232 41.1899 56.6680 43.9876 90.8063 59.9957 16.5964 71.9902 16.8544 22.7349 17.5309 11.0948 75.3013 32.2787 9.8191 9.3540 61.6202 37.5901 16.6595 29.6421 6.3554 13.3153 22.2199 1.0170 5.1754 4.6467 6.0594 1.0079 1.2024 0.6777 1.9615 5.6779 32.2049 4.6213 4.1912 4.7510 36.8932 9.8366 1.7918 9.3125 0.7821 1.5305 0.4823 2.9837 3.0435 6.6866 31.9315 39.8084 0.3802 0.9949 0.5305 2.5128 7.3026 2.0691 1.7806 2.6871 0.4199 0.8766 5.8283 10.2122 5.5761 2.5999 0.5400 98.7742 0.7281 0.2835 0.0852 0.3315 0.1165 0.3468 7.9547 13.0515 3.2615 20.4008 2.8835 1.0285 6.7398 4.0854 30.2709 64.7258 40.2524 7.5645 19.0313 6.7528 5.4363 12.0689 2.5121 6.0628 5.9555 8.3459 34.8904 37.1239 99.1367 35.5034 25.8783 51.7012 40.7815 12.5207 1.0006 10.4719 0.0300 0.3878 0.2589 0.9157 0.4599 1.7443 10.4178 77.4196 6.2137 13.3596 10.0191 10.1262 5.1399 9.2829 2.5126 3.4053 696.3847 13.0766 2.1157 50.7373 2.1531 531.7426 165.2258 16.5570 42.1079 196.2257 5.2123 9.8910 25.7365 10.7960 13.9681 10.1472 40.1148 0.9639 20.9937 150.6825 9.2262 1.6384 1.6655 0.1495 1.4269 21.3706 1081.1626 5.4795 22.8527 47.0074 15.5179 12.1978 12.7161 116.7959 45.8642 14.0080 23.5955 72.3274 45.6136 27.2614 9.1259 4.6613 10.8666 23.5589 1.2331 28.1916 1.5671 10.2660 91.8917 1.1415 0.0364 0.1447 6.5091 3.7100 6.8454 0.9668 0.5097 2.8188 5.7265 0.5785 1.8372 21.2316 343.7902 209.4818 1.0205 804.0299 41.2633 39.0799 48.1793 31.0215 18.5584 42.4579 37.1351 52.9194 51.5403 2.0483 8.4185 12.9592 0.9875 0.4564 2.8065 0.4375 0.0722 1.0726 1.2770 0.2562 0.9740 0.2501 8.7181 0.7888 1.0718 5.3976 1.4590 6.8445 0.8971 8.2415 2.5649 5.0450 8.9900 7.6746 10.2471 5.7159 7.8075 12.6463 1.4359 7.1527 15.0203 14.6357 20.5425 19.3713 8.9679 3.2847 2.5285 10.7711 8.4885 23.0747 0.6881 6.9394
temp: 298.150 k
press: 1.00000 atm
elementType: 46 15 6 6 6 6 1 6 1 6 1 1 1 6 6 6 6 1 6 1 6 1 1 1 6 6 6 6 1 6 1 6 1 1 1 15 6 6 6 6 1 6 1 6 1 1 1 6 6 6 6 1 6 1 6 1 1 1 6 6 6 6 1 6 1 6 1 1 1 6 6 6 6 6 1 1 1 1 1 7 6 8 8 6 6 6 6 1 6 1 6 1 1 1 6 1 1 1 6 6 6 6 6 6 1 1 1 1 1 1 1 1 1
symmnumber: 1
zpe: 2446480.6 jmol-1
zpe.correction: 0.931815 hartree
zpe.thermalcorrener: 0.986698 hartree
zpe.thermalcorrenthalpy: 0.987642 hartree
zpe.thermalcorrgfe: 0.839071 hartree
zpe.sumelectzpe: -3137.251117 hartree
zpe.sumelectthermal: -3137.196234 hartree
zpe.sumelectthermalent: -3137.195290 hartree
zpe.sumelectthermalfe: -3137.343862 hartree
dipole: -5.8407 -0.7589 0.6299
dipole: 5.9234
quadrupole: -317.0923 -316.3458 -328.8147
quadrupole: -0.4220 13.5330 -5.6831
quadrupole: 3.6586 4.4051 -8.0638 -0.4220 13.5330 -5.6831
hfenergy: -3138.1829324 hartree
pointgroup: C01 [X(C55H52N1O2P2Pd1)]
dipole: -2.2884196 -0.304458 0.3183337 debye
polarizability: 1049.9733174|-14.0993197|927.9333459|5.2065899|-61.925587|947.7511573 unknown
InChI: InChI=1/55C.N.2O.2P.Pd.52H
charge 1 multiplicity 1
113 atoms
Pd -0.48044222 -0.3489386 -0.6911264
P  -2.43167701 -1.33771015 0.2004046
C  -3.78122892 -0.22899221 0.73066702
C  -4.09787348 0.82360018 -0.13738477
C  -4.52910024 -0.41398384 1.896357
C  -5.12916904 1.70467035 0.17264485
H  -3.52953261 0.95632943 -1.06017999
C  -5.56593787 0.46762019 2.20171488
H  -4.29984325 -1.2365178 2.57646424
C  -5.86074418 1.53138527 1.34963074
H  -5.3558519 2.53245258 -0.50308539
H  -6.14160035 0.32465446 3.11897976
H  -6.66608677 2.22555465 1.60013009
C  -2.13733497 -2.49607889 1.56981939
C  -1.75265483 -1.96279103 2.80891812
C  -2.12455816 -3.88385385 1.38371753
C  -1.37778374 -2.80685387 3.84965297
H  -1.73746703 -0.88210236 2.96096028
C  -1.73931121 -4.72458525 2.42826487
H  -2.4079678 -4.31622105 0.42202631
C  -1.36775793 -4.1901521 3.66099422
H  -1.08502807 -2.37795356 4.81077914
H  -1.73000123 -5.80572463 2.27316554
H  -1.06718732 -4.85206358 4.47630295
C  -3.31896275 -2.29320243 -1.08848855
C  -4.45085501 -3.04540282 -0.7404277
C  -2.94542635 -2.2008994 -2.4330909
C  -5.17530476 -3.71499215 -1.72185937
H  -4.77195086 -3.1047592 0.30270836
C  -3.67822338 -2.86596185 -3.41635649
H  -2.08404062 -1.59466594 -2.72149429
C  -4.78888025 -3.62799672 -3.06128719
H  -6.05144452 -4.30357747 -1.4406658
H  -3.37653516 -2.78412693 -4.4628037
H  -5.36150763 -4.15198656 -3.82998086
P  -0.45672934 1.71172565 0.4791963
C  1.27927437 2.27301725 0.6124255
C  1.68007972 3.56861228 0.27293191
C  2.24473213 1.3492494 1.04093183
C  3.01992099 3.94224513 0.38750396
H  0.95008984 4.29322177 -0.09136001
C  3.57277061 1.73621875 1.18925814
H  1.96120181 0.31176952 1.23914764
C  3.96543613 3.03410375 0.85889254
H  3.32123177 4.95501807 0.11039325
H  4.30637143 1.01556817 1.5522195
H  5.01188716 3.33103209 0.96042523
C  -0.97948262 1.59366909 2.2428088
C  -0.09639008 1.15233449 3.23943525
C  -2.29827447 1.90371493 2.60322459
C  -0.52316433 1.01900557 4.55865941
H  0.93885875 0.91338096 2.99960885
C  -2.721188 1.77094954 3.92482453
H  -3.00699182 2.25692406 1.85316946
C  -1.83888993 1.32437885 4.90642971
H  0.18186854 0.67412422 5.31828593
H  -3.75366026 2.01692271 4.18151012
H  -2.17357688 1.21886535 5.94081186
C  -1.38068604 3.15974584 -0.12481611
C  -1.53052855 4.31045548 0.66403588
C  -1.94765345 3.12520871 -1.40086506
C  -2.24074051 5.40318359 0.17528584
H  -1.09683372 4.35082855 1.66593051
C  -2.65745393 4.22071513 -1.890391
H  -1.83926401 2.22766507 -2.00927055
C  -2.80584271 5.3595671 -1.10124501
H  -2.35553727 6.29486946 0.79554524
H  -3.09829667 4.17880358 -2.88867257
H  -3.36592811 6.21797006 -1.47923412
C  2.33513835 -1.82944212 -2.19799988
C  2.24902949 -2.27501643 0.2136622
C  0.95291549 -2.64835564 0.12177423
C  0.17272641 -2.35698157 -1.07445093
C  0.83152191 -1.68262682 -2.13812927
H  2.76893761 -1.03223504 -2.80947133
H  2.83407699 -2.40830726 1.12221193
H  0.48167448 -3.13559038 0.97482142
H  -0.70905204 -2.96361076 -1.29149058
H  0.36288699 -1.76070578 -3.12087738
N  2.92300808 -1.71100404 -0.86105885
C  4.21929831 -1.2643023 -0.8008343
O  4.69025567 -1.30783205 0.4611154
O  4.84599088 -0.88537153 -1.7600737
C  6.00582083 -0.9839776 0.73842729
C  6.68216669 -1.84940221 1.5939595
C  6.60730963 0.17853703 0.25850421
C  7.98741553 -1.54736271 1.97702636
H  6.17550441 -2.74760102 1.95172852
C  7.91550147 0.46469418 0.64697116
H  6.06440932 0.84544019 -0.40984071
C  8.6081168 -0.39133113 1.50332656
H  8.52087781 -2.2229266 2.64946039
H  8.39465247 1.37309726 0.27470041
H  9.63172145 -0.15630308 1.80278972
C  2.6856484 -3.18174063 -2.81573156
H  3.7777647 -3.27367061 -2.90272766
H  2.3061295 -4.01188995 -2.20191234
H  2.25312372 -3.26383664 -3.82303611
C  2.28601831 2.13141809 -3.21743909
C  1.7982222 1.11083824 -2.23060455
C  0.62222067 0.47481731 -2.32261102
C  -0.3110818 0.70021057 -3.48855123
C  -0.00193234 2.00638054 -4.22004866
C  1.48671863 2.11782235 -4.51272835
H  2.46511081 0.89927923 -1.39242288
H  2.23473964 3.12774612 -2.73848479
H  -0.21842906 -0.13911339 -4.20159121
H  -1.36780916 0.67978095 -3.17138118
H  -0.59402275 2.05345659 -5.14740723
H  -0.31373085 2.86392347 -3.60018765
H  1.79969738 1.25577576 -5.1275309
H  1.70170041 3.02111193 -5.10432663
H  3.3580404 1.95807249 -3.41182213
